{"text_format":"1","workbook":"xlsx","n_sheets":230,"sheets":["Helper_Benamingen","Overzicht_01","Overzicht_DICT_ID","LROI nummer","Overzicht_unique","Ziekenhuispatiëntnummer","Burger Service Nummer","Geslacht","Geboortedatum","Overlijdensdatum","Ziekenhuisnummer","Operatietype","Operatiedatum","Ziekenhuis waar operatie heeft","Operatiezijde","Positie prothese","Locatie prothese","Postcode","Buitenlandse postcode","Lichaamslengte","Lichaamsgewicht","Roken","BMI","Voorkeurshand","Diagnose","Andere diagnose, specificeer","Locatie artrose","ASA classificatie","Charnley classificatie","Walch classificatie","Infectie","Slijtage cup lager","Slijtage van insert","Slijtage inlay","Slijtage van polyethyleen","Periprothetische fractuur","Malpositie of malalignment","Malalignment","Malpositie","Luxatie","Luxatie patella","Luxatie bearing","Instabiliteit of dislocatie","Instabiliteit","Peri-articulaire ossificatie","Artrofibrose","Cuff artropathie","Onherstelbare cuff ruptuur","Metallose","Implantaatbreuk","Loslating acetabulumcomponent","Loslating femurcomponent","Loslating tibiacomponent","Loslating patellacomponent","Loslating taluscomponent","Loslating humeruscomponent","Loslating glenoïdcomponent","Loslating ulnacomponent","Loslating radiuscomponent","Loslating carpaalcomponent","Loslating proximale component","Loslating distale component","Symptomatische MoM articulatie","Progressie van artrose (partiël","Progressie van glenoïd artrose","Pijn","Cystevorming","Mechanische complicatie radiusk","Botresorptie rondom radiuscompo","Botresorptie rondom ulnacompone","Botresorptie rondom carpaalcomp","Botresorptie rondom proxi comp","Botresorptie rondom distal comp","Status na heupprothese-verwijde","Status na knieprotheseverwijder","Status na enkelprotheseverwijde","Status na schouderprotheseverwi","Status na elleboogprotheseverwi","Status na polsprotheseverwijder","Status na vingerprotheseverwijd","Andere reden voor revisie","Andere reden voor revisie, spec","Specialisme","BIG hoofdoperateur","BIG assisterend chirurg","Type prothese","Ander type prothese, spec","Indien unicondylair, zijde prot","Plaatsing patellacomponent","Radiuskopcomponent geplaatst","Prothese gelinkt","Gereviseerde prothese","Type humeral comp v gerev proth","Type revisie","Ander type revisie, spec","Conversie naar totale heupproth","Amputatie","Conversie naar totale knieproth","Conversie van hemi_total schoud","Conversie van total_hemischoud","Conversie naar totale elleboog","Patellacomponent bijgeplaats","Unicompartimentele proth bijgep","VKB functioneel intact","Radiuskopresectie","Linking ulnar cap","Acetabulumcomponent gerev","Inlay_lager gereviseerd","Femurkopcomponent gereviseerd","Femurcomponent gereviseerd","Tibiacomponent gereviseerd","Inlay gereviseerd","Patellacomponent gereviseerd","Taluscomponent gereviseerd","Humeruscomponent gereviseerd","Humeruskop_humerale liner gerev","Glenoïdcup_glenosfeer gerev","Metafyse_taper gereviseerd","Glenoïd liner_baseplate gerev","Radiuscomponent gereviseerd","Ulnacomponent gereviseerd","Carpaalcomponent gereviseerd","Proximale component gerev","Distale component gereviseerd","Benadering","Andere benadering, specificeer","Correctie osteotomie uitgev","Osteosynthese uitgevoerd","Tuberositas osteotomie uitgev","Mm osteotomie uitgev","Achillespeesverlenging uitgev","Ligament reconstructie uitgev","Osteotomie van het tm uitgev","Acromioplastiek uitgevoerd","Cuff reconstructie uitgevoerd","Distale clavicula resect uitgev","LCL losgemaakt","Decompressie ulnaire zenuw","Transpositie ulnaire zenuw","Weke delen stabilisatie","Andere weke delen stabili, spec","Darrach procedure uitgevoerd","Ulna osteotomie uitgevoerd","Proximale rij resectie uitgev","Andere botprocedure, spec","PSI gebruikt","Navigatie gebruikt","Doorlichting gebruikt","Robotassistentie gebruikt","Botgraft gebruikt","Patellectomie uitgevoerd","Artrodese uitgevoerd","Onder bloedleegte uitgevoerd","Voorgaande operaties","Osteosynthese","Osteotomie","Artrodese","Girdlestone","Artroscopie","Open meniscectomie","Voorste kruisband reconstructie","Synovectomie","Patella realignment procedure","Knie distractie","Behandeling osteochondraal botd","Ligament reconstructie","Achtervoetchirurgie","Voorvoetchirurgie","Acromioplastiek","Herstellen van de rotator cuff","Distale clavicula resectie","Stabilisatieprocedure","Tenotomie bicepspees","Tenodesis bicepspees","Laterale artrotomie","Mediale artrotomie","Posterieure artrotomie","Decompressie ulnaire zenuw (vo)","Transpositie ulnaire zenuw (vo)","Radiuskopresectie (vo)","Plaat- of schroefverwijdering","Osteosynthese radius","Osteosynthese ulna","Osteosynthese carpus","Correctie osteotomie radius","Correction osteotomy ulna","Proximale rij resectie","Totale artrodese","Partiële artrodese","Sauvé-Kapandji","Ligamentaire reconstructie","Interpositie plastiek","Osteosynth intra-articul fract","Plaatsing spacer","Andere voorgaande operaties","Andere vg operaties, spec","Fixatie","Lavage","Vacuum mix","Pressurising","Acetabulumcomponent gecem","Femurcomponent gecementeerd","Cement-in-cement","Tibiacomponent gecementeerd","Patellacomponent gecementeerd","Humeruscomponent gecementeerd","Glenoïdcomponent gecementeerd","Ulnacomponent gecementeerd","Radiuscomponent gecementeerd","Carpaalcomponent gecementeerd","Proximale component gecem","Distale component gecementeerd","Productnummer cement 1","Lotnummer cement 1","Productnummer cement 2","Lotnummer cement 2","Productnummer cement 3","Lotnummer cement 3","Productnummer cement 4","Lotnummer cement 4","Productnummer","Lot nummer","Meer dan 1 acetabulumcomponent","Meer dan 1 femurcomponent","Meer dan 1 femurkopcomponent","Meer dan 1 femoral component","Meer dan 1 tibia component","Meer dan 1 humerus component","Meer dan 1 ulna component","Productnummer (code)"],"not_rendered":{"charts":0,"images":0,"macros":1,"external_links":0,"defined_names":3,"comments":2,"pivot_tables":0},"unopened":[],"bounds":{"document_bytes":16777216,"sheet_cells":100000,"rows_first":2000,"rows_last":500,"rows_between":2000,"halvings":0,"cell_chars":16384,"cell_head_chars":4096},"cells_cut":0,"cells_raw":0,"read":"whole","date_system":"1900"}

{"sheet":"Helper_Benamingen","index":0,"n_rows":216,"n_cols":2,"rows_kept":216,"cut":false,"hidden":true,"merged":[]}
["Sheet name","Description"]
["LROI nummer","LROI nummer"]
["Ziekenhuispatiëntnummer","Ziekenhuispatiëntnummer"]
["Burger Service Nummer","Burger Service Nummer "]
["Geslacht","Geslacht"]
["Geboortedatum","Geboortedatum"]
["Overlijdensdatum","Overlijdensdatum"]
["Ziekenhuisnummer","Ziekenhuisnummer"]
["Operatietype","Operatietype"]
["Operatiedatum","Operatiedatum"]
["Ziekenhuis waar operatie heeft","Ziekenhuis waar operatie heeft plaatsgevonden"]
["Operatiezijde","Operatiezijde"]
["Positie prothese","Positie prothese"]
["Locatie prothese","Locatie prothese"]
["Postcode","Postcode"]
["Buitenlandse postcode","Buitenlandse postcode"]
["Lichaamslengte","Lichaamslengte"]
["Lichaamsgewicht","Lichaamsgewicht"]
["Roken","Roken"]
["BMI","BMI"]
["Diagnose","Diagnose"]
["Andere diagnose, specificeer","Andere diagnose, specificeer"]
["ASA classificatie","ASA classificatie"]
["Charnley classificatie","Charnley classificatie"]
["Walch classificatie","Walch classificatie"]
["Infectie","Infectie"]
["Slijtage cup_lager","Slijtage cup/lager"]
["Slijtage van insert","Slijtage van insert"]
["Slijtage inlay","Slijtage inlay"]
["Slijtage van polyethyleen","Slijtage van polyethyleen"]
["Periprothetische fractuur","Periprothetische fractuur"]
["Malpositie of malalignment","Malpositie of malalignment"]
["Malalignment","Malalignment"]
["Malpositie","Malpositie"]
["Luxatie","Luxatie"]
["Luxatie patella","Luxatie patella"]
["Luxatie bearing","Luxatie bearing"]
["Instabiliteit of dislocatie","Instabiliteit of dislocatie"]
["Instabiliteit","Instabiliteit"]
["Peri-articulaire ossificatie","Peri-articulaire ossificatie"]
["Artrofibrose","Artrofibrose"]
["Cuff artropathie","Cuff artropathie"]
["Onherstelbare cuff ruptuur","Onherstelbare cuff ruptuur"]
["Metallose","Metallose"]
["Implantaatbreuk","Implantaatbreuk"]
["Loslating acetabulumcomponent","Loslating acetabulumcomponent"]
["Loslating femurcomponent","Loslating femurcomponent"]
["Loslating tibiacomponent","Loslating tibiacomponent"]
["Loslating patellacomponent","Loslating patellacomponent"]
["Loslating taluscomponent","Loslating taluscomponent"]
["Loslating humeruscomponent","Loslating humeruscomponent"]
["Loslating glenoïdcomponent","Loslating glenoïdcomponent"]
["Loslating ulnacomponent","Loslating ulnacomponent"]
["Loslating radiuscomponent","Loslating radiuscomponent"]
["Loslating carpaalcomponent","Loslating carpaalcomponent"]
["Loslating proximale component","Loslating proximale component"]
["Loslating distale component","Loslating distale component"]
["Symptomatische MoM articulatie","Symptomatische MoM articulatie"]
["Progressie van artrose (partiël","Progressie van artrose (partiële knieprothese)"]
["Progressie van glenoïd artrose","Progressie van glenoïd artrose"]
["Pijn","Pijn"]
["Cystevorming","Cystevorming"]
["Mechanische complicatie radiusk","Mechanische complicatie radiuskopprothese"]
["Botresorptie rondom radiuscompo","Botresorptie rondom radiuscomponent"]
["Botresorptie rondom ulnacompone","Botresorptie rondom ulnacomponent"]
["Botresorptie rondom carpaalcomp","Botresorptie rondom carpaalcomponent"]
["Botresorptie rondom proxi comp","Botresorptie rondom proximale component"]
["Botresorptie rondom distal comp","Botresorptie rondom distale component"]
["Status na heupprothese-verwijde","Status na heupprothese-verwijdering (Girdlestone)"]
["Status na knieprotheseverwijder","Status na knieprotheseverwijdering"]
["Status na enkelprotheseverwijde","Status na enkelprotheseverwijdering"]
["Status na schouderprotheseverwi","Status na schouderprotheseverwijdering"]
["Status na elleboogprotheseverwi","Status na elleboogprotheseverwijdering"]
["Status na polsprotheseverwijder","Status na polsprotheseverwijdering"]
["Status na vingerprotheseverwijd","Status na vingerprotheseverwijdering"]
["Andere reden voor revisie","Andere reden voor revisie"]
["Andere reden voor revisie, spec","Andere reden voor revisie, specificeer"]
["Specialisme","Specialisme"]
["BIG hoofdoperateur","BIG hoofdoperateur"]
["BIG assisterend chirurg","BIG assisterend chirurg"]
["Type prothese","Type prothese"]
["Ander type prothese, spec","Ander type prothese, specificeer"]
["Indien unicondylair, zijde prot","Indien unicondylair, zijde prothese"]
["Plaatsing patellacomponent","Plaatsing patellacomponent"]
["Radiuskopcomponent geplaatst","Radiuskopcomponent geplaatst"]
["Prothese gelinkt","Prothese gelinkt"]
["Gereviseerde prothese","Gereviseerde prothese"]
["Type humeral comp v gerev proth","Type humerale component van gereviseerde prothese"]
["Type revisie","Type revisie"]
["Ander type revisie, spec","Ander type revisie, specificeer"]
["Conversie naar totale heupproth","Conversie naar totale heupprothese"]
["Amputatie","Amputatie"]
["Conversie naar totale knieproth","Conversie naar totale knieprothese"]
["Conversie van hemi_total schoud","Conversie van hemi naar totale schouderprothese"]
["Conversie van total_hemischoud","Conversie van totale naar hemischouderprothese"]
["Conversie naar totale elleboog","Conversie naar totale elleboogprothese"]
["Patellacomponent bijgeplaats","Patellacomponent (bij)geplaatst"]
["Unicompartimentele proth bijgep","Unicompartimentele prothese  bijgeplaatst"]
["VKB functioneel intact","VKB functioneel intact"]
["Radiuskopresectie","Radiuskopresectie"]
["Linking ulnar cap","Linking ulnar cap"]
["Acetabulumcomponent gerev","Acetabulumcomponent gereviseerd"]
["Inlay_lager gereviseerd","Inlay/lager gereviseerd"]
["Femurkopcomponent gereviseerd","Femurkopcomponent gereviseerd"]
["Femurcomponent gereviseerd","Femurcomponent gereviseerd"]
["Tibiacomponent gereviseerd","Tibiacomponent gereviseerd"]
["Inlay gereviseerd","Inlay gereviseerd"]
["Patellacomponent gereviseerd","Patellacomponent gereviseerd"]
["Taluscomponent gereviseerd","Taluscomponent gereviseerd"]
["Humeruscomponent gereviseerd","Humeruscomponent gereviseerd"]
["Humeruskop_humerale liner gerev","Humeruskop/humerale liner gereviseerd"]
["Glenoïdcup_glenosfeer gerev","Glenoïdcup/glenosfeer gereviseerd"]
["Metafyse_taper gereviseerd","Metafyse/taper gereviseerd"]
["Glenoïd liner_baseplate gerev","Glenoïd liner/baseplate gereviseerd"]
["Ulnacomponent gereviseerd","Ulnacomponent gereviseerd"]
["Radiuscomponent gereviseerd","Radiuscomponent gereviseerd"]
["Ulnacomponent gereviseerd","Ulnacomponent gereviseerd"]
["Carpaalcomponent gereviseerd","Carpaalcomponent gereviseerd"]
["Proximale component gerev","Proximale component gereviseerd"]
["Distale component gereviseerd","Distale component gereviseerd"]
["Benadering","Benadering"]
["Andere benadering, specificeer","Andere benadering, specificeer"]
["Correctie osteotomie uitgev","(Correctie) osteotomie uitgevoerd"]
["Osteosynthese uitgevoerd","Osteosynthese uitgevoerd"]
["Tuberositas osteotomie uitgev","Tuberositas osteotomie uitgevoerd"]
["Mm osteotomie uitgev","Mediale malleolus osteotomie uitgevoerd"]
["Achillespeesverlenging uitgev","Achillespeesverlenging uitgevoerd"]
["Ligament reconstructie uitgev","Ligament reconstructie uitgevoerd"]
["Osteotomie van het tm uitgev","Osteotomie van het tuberculum minus uitgevoerd"]
["Acromioplastiek uitgevoerd","Acromioplastiek uitgevoerd"]
["Cuff reconstructie uitgevoerd","Cuff reconstructie uitgevoerd"]
["Distale clavicula resect uitgev","Distale clavicula resectie uitgevoerd"]
["LCL losgemaakt","LCL losgemaakt"]
["Decompressie ulnaire zenuw","Decompressie ulnaire zenuw"]
["Transpositie ulnaire zenuw","Transpositie ulnaire zenuw"]
["Weke delen stabilisatie","Weke delen stabilisatie"]
["Andere weke delen stabili, spec","Andere weke delen stabilisatie, specificeer"]
["Darrach procedure uitgevoerd","Darrach procedure uitgevoerd"]
["Ulna osteotomie uitgevoerd","Ulna osteotomie uitgevoerd"]
["Proximale rij resectie uitgev","Proximale rij resectie uitgevoerd"]
["Andere botprocedure, spec","Andere botprocedure, specificeer"]
["PSI gebruikt","Patient Specific Instrumentation (PSI) gebruikt"]
["Navigatie gebruikt","Navigatie gebruikt"]
["Doorlichting gebruikt","Doorlichting gebruikt"]
["Robotassistentie gebruikt","Robotassistentie gebruikt"]
["Botgraft gebruikt","Botgraft gebruikt"]
["Patellectomie uitgevoerd","Patellectomie uitgevoerd"]
["Artrodese uitgevoerd","Artrodese uitgevoerd"]
["Onder bloedleegte uitgevoerd","Onder bloedleegte uitgevoerd"]
["Voorgaande operaties","Voorgaande operaties"]
["Osteosynthese","Osteosynthese"]
["Osteotomie","Osteotomie"]
["Artrodese","Artrodese"]
["Girdlestone","Girdlestone"]
["Artroscopie","Artroscopie"]
["Open meniscectomie","Open meniscectomie"]
["Voorste kruisband reconstructie","Voorste kruisband reconstructie"]
["Synovectomie","Synovectomie"]
["Patella realignment procedure","Patella realignment procedure"]
["Knie distractie","Knie distractie"]
["Behandeling osteochondraal botd","Behandeling osteochondraal botdefect"]
["Ligament reconstructie","Ligament reconstructie"]
["Achtervoetchirurgie","Achtervoetchirurgie"]
["Voorvoetchirurgie","Voorvoetchirurgie"]
["Acromioplastiek","Acromioplastiek"]
["Herstellen van de rotator cuff","Herstellen van de rotator cuff"]
["Distale clavicula resectie","Distale clavicula resectie"]
["Stabilisatieprocedure","Stabilisatieprocedure"]
["Tenotomie bicepspees","Tenotomie bicepspees"]
["Tenodesis bicepspees","Tenodesis bicepspees"]
["Laterale artrotomie","Laterale artrotomie"]
["Mediale artrotomie","Mediale artrotomie"]
["Posterieure artrotomie","Posterieure artrotomie"]
["Decompressie ulnaire zenuw (vo)","Decompressie ulnaire zenuw (vo)"]
["Transpositie ulnaire zenuw (vo)","Transpositie ulnaire zenuw (vo)"]
["Radiuskopresectie (vo)","Radiuskopresectie (vo)"]
["Plaat- of schroefverwijdering","Plaat- of schroefverwijdering"]
["Osteosynthese radius","Osteosynthese radius"]
["Osteosynthese ulna","Osteosynthese ulna"]
["Osteosynthese carpus","Osteosynthese carpus"]
["Correctie osteotomie radius","Correctie osteotomie radius"]
["Correction osteotomy ulna","Correction osteotomy ulna"]
["Proximale rij resectie","Proximale rij resectie"]
["Totale artrodese","Totale artrodese"]
["Partiële artrodese","Partiële artrodese"]
["Sauvé-Kapandji","Sauvé-Kapandji"]
["Ligamentaire reconstructie","Ligamentaire reconstructie"]
["Interpositie plastiek","Interpositie plastiek"]
["Osteosynth intra-articul fract","Osteosynthese intra-articulaire fractuur"]
["Plaatsing spacer","Plaatsing spacer"]
["Andere voorgaande operaties","Andere voorgaande operaties"]
["Andere vg operaties, spec","Andere voorgaande operaties, specificeer"]
["Fixatie","Fixatie"]
["Lavage","Lavage"]
["Vacuum mix","Vacuum (mix)"]
["Pressurising","Pressurising"]
["Acetabulumcomponent gecem","Acetabulumcomponent gecementeerd"]
["Femurcomponent gecementeerd","Femurcomponent gecementeerd"]
["Cement-in-cement","Cement-in-cement"]
["Tibiacomponent gecementeerd","Tibiacomponent gecementeerd"]
["Patellacomponent gecementeerd","Patellacomponent gecementeerd"]
["Humeruscomponent gecementeerd","Humeruscomponent gecementeerd"]
["Glenoïdcomponent gecementeerd","Glenoïdcomponent gecementeerd"]
["Ulnacomponent gecementeerd","Ulnacomponent gecementeerd"]
["Radiuscomponent gecementeerd","Radiuscomponent gecementeerd"]
["Carpaalcomponent gecementeerd","Carpaalcomponent gecementeerd"]
["Proximale component gecem","Proximale component gecementeerd"]
["Distale component gecementeerd","Distale component gecementeerd"]
["Productnummer cement 1","Productnummer cement 1"]
["Lotnummer cement 1","Lotnummer cement 1"]
["Productnummer cement 2","Productnummer cement 2"]
["Lotnummer cement 2","Lotnummer cement 2"]
["Productnummer cement 3","Productnummer cement 3"]
["Lotnummer cement 3","Lotnummer cement 3"]
["Productnummer cement 4","Productnummer cement 4"]
["Lotnummer cement 4","Lotnummer cement 4"]

{"sheet":"Overzicht_01","index":1,"n_rows":296,"n_cols":20,"rows_kept":296,"cut":false,"hidden":false,"merged":[]}
["Label NL","Variabelenaam (XML)","Sectie","Verplicht","Patient \nPrimair","Patient \nRevisie","Heup Primair","Heup Revisie","Knie \nPrimair","Knie \nRevisie","Enkel Primair","Enkel Revisie","Schouder Primair","Schouder Revisie","Elleboog Primair","Elleboog Revisie","Pols \nPrimair","Pols \nRevisie","Vinger Primair","Vinger Revisie"]
[null,null,null,null,"Patient","Patient","Heup","Heup","Knie","Knie","Enkel","Enkel","Schouder","Schouder","Elleboog","Elleboog","Pols","Pols","Vinger","Vinger"]
[null,null,null,null,"Primary","Revision","Primary","Revision","Primary","Revision","Primary","Revision","Primary","Revision","Primary","Revision","Primary","Revision","Primary","Revision"]
[{"$f":"HYPERLINK(\"#'\"&Helper_Benamingen!$A2&\"'!A1\", Helper_Benamingen!B2)","v":"LROI nummer"}," ","Index administratie","n.v.t.","Automatisch gegenereerd","Automatisch gegenereerd","","","","","","","","","","","","","",""]
[{"$f":"HYPERLINK(\"#'\"&Helper_Benamingen!$A3&\"'!A1\", Helper_Benamingen!B3)","v":"Ziekenhuispatiëntnummer"},"patientnumber","Patiënt ",1,1,2,"","","","","","","","","","","","","",""]
[{"$f":"HYPERLINK(\"#'\"&Helper_Benamingen!$A4&\"'!A1\", Helper_Benamingen!B4)","v":"Burger Service Nummer "},"bsn","Patiënt",0,1,2,"","","","","","","","","","","","","",""]
[{"$f":"HYPERLINK(\"#'\"&Helper_Benamingen!$A5&\"'!A1\", Helper_Benamingen!B5)","v":"Geslacht"},"gender","Patiënt",1,1,2,"","","","","","","","","","","","","",""]
[{"$f":"HYPERLINK(\"#'\"&Helper_Benamingen!$A6&\"'!A1\", Helper_Benamingen!B6)","v":"Geboortedatum"},"birthdate","Patiënt",1,1,2,"","","","","","","","","","","","","",""]
[{"$f":"HYPERLINK(\"#'\"&Helper_Benamingen!$A7&\"'!A1\", Helper_Benamingen!B7)","v":"Overlijdensdatum"},"deathdate","Patiënt",0,1,2,"","","","","","","","","","","","","",""]
[{"$f":"HYPERLINK(\"#'\"&Helper_Benamingen!$A8&\"'!A1\", Helper_Benamingen!B8)","v":"Ziekenhuisnummer"},"hospitalId","Patiënt","n.v.t.","Vanuit formulierkeuze","Vanuit formulierkeuze","","","","","","","","","","","","","",""]
[{"$f":"HYPERLINK(\"#'\"&Helper_Benamingen!$A9&\"'!A1\", Helper_Benamingen!B9)","v":"Operatietype"},"procedureType","Algemene informatie",1,"","","Vanuit formulierkeuze","Vanuit formulierkeuze","Vanuit formulierkeuze","Vanuit formulierkeuze","Vanuit formulierkeuze","Vanuit formulierkeuze","Vanuit formulierkeuze","Vanuit formulierkeuze","Vanuit formulierkeuze","Vanuit formulierkeuze","Vanuit formulierkeuze","Vanuit formulierkeuze","Vanuit formulierkeuze","Vanuit formulierkeuze"]
[{"$f":"HYPERLINK(\"#'\"&Helper_Benamingen!$A10&\"'!A1\", Helper_Benamingen!B10)","v":"Operatiedatum"},"procedureDate","Algemene informatie",1,"","",1,2,1,2,1,2,1,2,1,2,1,2,1,2]
[{"$f":"HYPERLINK(\"#'\"&Helper_Benamingen!$A11&\"'!A1\", Helper_Benamingen!B11)","v":"Ziekenhuis waar operatie heeft plaatsgevonden"},"implantingProcedureHospital","Algemene informatie",1,"","",1,2,1,2,1,2,1,2,1,2,1,2,1,2]
[{"$f":"HYPERLINK(\"#'\"&Helper_Benamingen!$A12&\"'!A1\", Helper_Benamingen!B12)","v":"Operatiezijde"},"procedureSide","Algemene informatie",1,"","",1,2,1,2,1,2,1,2,1,2,1,2,1,2]
[{"$f":"HYPERLINK(\"#'\"&Helper_Benamingen!$A13&\"'!A1\", Helper_Benamingen!B13)","v":"Positie prothese"},"prosthesisPosition","Algemene informatie",1,"","","","","","","","","","","","","","",1,2]
[{"$f":"HYPERLINK(\"#'\"&Helper_Benamingen!$A14&\"'!A1\", Helper_Benamingen!B14)","v":"Locatie prothese"},"prosthesisLocation","Algemene informatie",1,"","","","","","","","","","","","","","",1,2]
[{"$f":"HYPERLINK(\"#'\"&Helper_Benamingen!$A15&\"'!A1\", Helper_Benamingen!B15)","v":"Postcode"},"patientPostalcode","Patiënt ",0,"","",1,2,1,2,1,2,1,2,1,2,1,2,1,2]
[{"$f":"HYPERLINK(\"#'\"&Helper_Benamingen!$A16&\"'!A1\", Helper_Benamingen!B16)","v":"Buitenlandse postcode"},"foreignPostalCode","Patiënt",0,"","",1,2,1,2,1,2,1,2,1,2,1,2,1,2]
[{"$f":"HYPERLINK(\"#'\"&Helper_Benamingen!$A17&\"'!A1\", Helper_Benamingen!B17)","v":"Lichaamslengte"},"patientLength","Patiënt",0,"","",1,2,1,2,1,2,1,2,1,2,1,2,1,2]
[{"$f":"HYPERLINK(\"#'\"&Helper_Benamingen!$A18&\"'!A1\", Helper_Benamingen!B18)","v":"Lichaamsgewicht"},"patientWeight","Patiënt",0,"","",1,2,1,2,1,2,1,2,1,2,1,2,1,2]
[{"$f":"HYPERLINK(\"#'\"&Helper_Benamingen!$A19&\"'!A1\", Helper_Benamingen!B19)","v":"Roken"},"patientSmoking","Patiënt",0,"","",1,2,1,2,1,2,1,2,1,2,1,2,1,2]
[{"$f":"HYPERLINK(\"#'\"&Helper_Benamingen!$A20&\"'!A1\", Helper_Benamingen!B20)","v":"BMI"},"patientBmi","Patiënt",0,"","",1,2,1,2,1,2,1,2,1,2,1,2,1,2]
["Voorkeurshand","handedness","Patiënt",0,"",null,"","","","","","",1,2,1,2,1,2,1,2]
[{"$f":"HYPERLINK(\"#'\"&Helper_Benamingen!$A21&\"'!A1\", Helper_Benamingen!B21)","v":"Diagnose"},"diagnosis","Diagnose ",0,"","",1,null,1,null,1,null,1,null,1,null,1,null,1]
[{"$f":"HYPERLINK(\"#'\"&Helper_Benamingen!$A22&\"'!A1\", Helper_Benamingen!B22)","v":"Andere diagnose, specificeer"},"diagnosisOther","Diagnose ",0,"","",1,null,1,null,1,null,1,null,1,null,1,null,1]
["Locatie artrose","locationOsteoarthritis","Diagnose ",0,{"$f":"IF(NOT(ISERROR(LEFT(E25, FIND(\" \",E25)-1))), LEFT(E25, FIND(\" \",E25)-1), E25)","v":""},null,null,null,1]
[{"$f":"HYPERLINK(\"#'\"&Helper_Benamingen!$A23&\"'!A1\", Helper_Benamingen!B23)","v":"ASA classificatie"},"asaClassification","Diagnose / Reden voor revisie",0,"","",1,2,1,2,1,2,1,2,1,2,1,2,1,2]
[{"$f":"HYPERLINK(\"#'\"&Helper_Benamingen!$A24&\"'!A1\", Helper_Benamingen!B24)","v":"Charnley classificatie"},"charnleyClassification","Diagnose / Reden voor revisie",0,"","",1,2,1,2,1,2,"","","","","","","",""]
[{"$f":"HYPERLINK(\"#'\"&Helper_Benamingen!$A25&\"'!A1\", Helper_Benamingen!B25)","v":"Walch classificatie"},"walch","Diagnose",0,"","","","",null,"",null,"",null,2,"","","","","",""]
[{"$f":"HYPERLINK(\"#'\"&Helper_Benamingen!$A26&\"'!A1\", Helper_Benamingen!B26)","v":"Infectie"},"infection","Reden voor revisie",0,"","",null,2,null,2,null,2,null,2,null,2,null,2,"",""]
["Slijtage cup/lager","cupLinerWear","Reden voor revisie",0,"","",null,2,null,"",null,"",null,"",null,"",null,"","",""]
[{"$f":"HYPERLINK(\"#'\"&Helper_Benamingen!$A28&\"'!A1\", Helper_Benamingen!B28)","v":"Slijtage van insert"},"wearInlay","Reden voor revisie",0,"","",null,"",null,2,null,"",null,"",null,"",null,"","",""]
[{"$f":"HYPERLINK(\"#'\"&Helper_Benamingen!$A29&\"'!A1\", Helper_Benamingen!B29)","v":"Slijtage inlay"},"wearOfInlay","Reden voor revisie",0,"","",null,"",null,"",null,2,null,"",null,"",null,"","",""]
[{"$f":"HYPERLINK(\"#'\"&Helper_Benamingen!$A30&\"'!A1\", Helper_Benamingen!B30)","v":"Slijtage van polyethyleen"},"polyethyleneWear","Reden voor revisie",0,"","",null,"",null,"",null,"",null,"",null,2,null,"","",""]
[{"$f":"HYPERLINK(\"#'\"&Helper_Benamingen!$A31&\"'!A1\", Helper_Benamingen!B31)","v":"Periprothetische fractuur"},"periprostheticFracture","Reden voor revisie",0,"","",null,2,null,2,null,2,null,2,null,2,null,2,"",""]
[{"$f":"HYPERLINK(\"#'\"&Helper_Benamingen!$A32&\"'!A1\", Helper_Benamingen!B32)","v":"Malpositie of malalignment"},"malalignment","Reden voor revisie",0,"","",null,2,null,2,null,null,null,2,null,2,null,2,null,2]
[{"$f":"HYPERLINK(\"#'\"&Helper_Benamingen!$A33&\"'!A1\", Helper_Benamingen!B33)","v":"Malalignment"},"malalignment","Reden voor revisie",0,"","",null,null,null,null,null,2]
[{"$f":"HYPERLINK(\"#'\"&Helper_Benamingen!$A34&\"'!A1\", Helper_Benamingen!B34)","v":"Malpositie"},"malposition","Reden voor revisie",0,"","",null,"",null,"",null,2,null,"",null,"",null,"",null,""]
[{"$f":"HYPERLINK(\"#'\"&Helper_Benamingen!$A35&\"'!A1\", Helper_Benamingen!B35)","v":"Luxatie"},"dislocation","Reden voor revisie",0,"","",null,2,null,"",null,"",null,"",null,"",null,2,null,2]
[{"$f":"HYPERLINK(\"#'\"&Helper_Benamingen!$A36&\"'!A1\", Helper_Benamingen!B36)","v":"Luxatie patella"},"patellaDislocation","Reden voor revisie",0,"","",null,"",null,2,null,"",null,"",null,"",null,"",null,""]
[{"$f":"HYPERLINK(\"#'\"&Helper_Benamingen!$A37&\"'!A1\", Helper_Benamingen!B37)","v":"Luxatie bearing"},"bearingDislocation","Reden voor revisie",0,"","",null,"",null,2,null,"",null,"",null,"",null,"",null,""]
[{"$f":"HYPERLINK(\"#'\"&Helper_Benamingen!$A38&\"'!A1\", Helper_Benamingen!B38)","v":"Instabiliteit of dislocatie"},"instability","Reden voor revisie",0,"","",null,"",null,2,null,null,null,2,null,2,null,2,null,2]
[{"$f":"HYPERLINK(\"#'\"&Helper_Benamingen!$A39&\"'!A1\", Helper_Benamingen!B39)","v":"Instabiliteit"},"instability","Reden voor revisie",0,"","",null,"",null,null,null,2]
[{"$f":"HYPERLINK(\"#'\"&Helper_Benamingen!$A40&\"'!A1\", Helper_Benamingen!B40)","v":"Peri-articulaire ossificatie"},"periArticularOssification","Reden voor revisie",0,"","",null,2,null,"",null,"",null,"",null,"",null,"",null,""]
[{"$f":"HYPERLINK(\"#'\"&Helper_Benamingen!$A41&\"'!A1\", Helper_Benamingen!B41)","v":"Artrofibrose"},"arthrofibrosis","Reden voor revisie",0,"","","","",null,2,null,2,null,"",null,"",null,"",null,""]
[{"$f":"HYPERLINK(\"#'\"&Helper_Benamingen!$A42&\"'!A1\", Helper_Benamingen!B42)","v":"Cuff artropathie"},"cuffArthropathy","Reden voor revisie",0,"","","","","","","","",null,2,null,"",null,"",null,""]
[{"$f":"HYPERLINK(\"#'\"&Helper_Benamingen!$A43&\"'!A1\", Helper_Benamingen!B43)","v":"Onherstelbare cuff ruptuur"},"cuffRupture","Reden voor revisie",0,"","","","","","","","",null,2,null,"",null,"",null,""]
[{"$f":"HYPERLINK(\"#'\"&Helper_Benamingen!$A44&\"'!A1\", Helper_Benamingen!B44)","v":"Metallose"},"metallosis","Reden voor revisie",0,"","","","","","","","",null,"",null,2,null,"",null,""]
[{"$f":"HYPERLINK(\"#'\"&Helper_Benamingen!$A45&\"'!A1\", Helper_Benamingen!B45)","v":"Implantaatbreuk"},"implantBreakage","Reden voor revisie",0,"","","","","","","","","","",null,"",null,2,null,2]
[{"$f":"HYPERLINK(\"#'\"&Helper_Benamingen!$A46&\"'!A1\", Helper_Benamingen!B46)","v":"Loslating acetabulumcomponent"},"looseningAcetabularComponent","Reden voor revisie",0,"","",null,2,null,"","","","","","","",null,"","",""]
[{"$f":"HYPERLINK(\"#'\"&Helper_Benamingen!$A47&\"'!A1\", Helper_Benamingen!B47)","v":"Loslating femurcomponent"},"looseningFemoralComponent","Reden voor revisie",0,"","",null,2,null,2,null,"","","","","","","","",""]
[{"$f":"HYPERLINK(\"#'\"&Helper_Benamingen!$A48&\"'!A1\", Helper_Benamingen!B48)","v":"Loslating tibiacomponent"},"looseningTibialComponent","Reden voor revisie",0,"","","","",null,2,null,2,"","","","","","","",""]
[{"$f":"HYPERLINK(\"#'\"&Helper_Benamingen!$A49&\"'!A1\", Helper_Benamingen!B49)","v":"Loslating patellacomponent"},"looseningPatellarComponent","Reden voor revisie",0,"","","","",null,2,null,"","","","","","","","",""]
[{"$f":"HYPERLINK(\"#'\"&Helper_Benamingen!$A50&\"'!A1\", Helper_Benamingen!B50)","v":"Loslating taluscomponent"},"looseningTalusComponent","Reden voor revisie",0,"","","","",null,"",null,2,"","","","","","","",""]
[{"$f":"HYPERLINK(\"#'\"&Helper_Benamingen!$A51&\"'!A1\", Helper_Benamingen!B51)","v":"Loslating humeruscomponent"},"looseningHumeralComponent","Reden voor revisie",0,"","","","",null,"",null,"",null,2,null,2,"","","",""]
[{"$f":"HYPERLINK(\"#'\"&Helper_Benamingen!$A52&\"'!A1\", Helper_Benamingen!B52)","v":"Loslating glenoïdcomponent"},"looseningGlenoidComponent","Reden voor revisie",0,"","","","",null,"",null,"",null,2,null,"",null,"","",""]
[{"$f":"HYPERLINK(\"#'\"&Helper_Benamingen!$A53&\"'!A1\", Helper_Benamingen!B53)","v":"Loslating ulnacomponent"},"looseningUlnarComponent","Reden voor revisie",0,"","","","",null,"",null,"",null,"",null,2,null,2,"",""]
[{"$f":"HYPERLINK(\"#'\"&Helper_Benamingen!$A54&\"'!A1\", Helper_Benamingen!B54)","v":"Loslating radiuscomponent"},"looseningRadialComponent","Reden voor revisie",0,"","","","",null,"",null,"",null,"",null,"",null,2,"",""]
[{"$f":"HYPERLINK(\"#'\"&Helper_Benamingen!$A55&\"'!A1\", Helper_Benamingen!B55)","v":"Loslating carpaalcomponent"},"looseningCarpalComponent ","Reden voor revisie",0,"","","","",null,"",null,"",null,"",null,"",null,2,null,""]
[{"$f":"HYPERLINK(\"#'\"&Helper_Benamingen!$A56&\"'!A1\", Helper_Benamingen!B56)","v":"Loslating proximale component"},"looseningProximalComponent","Reden voor revisie",0,"","","","",null,"",null,"",null,"",null,"",null,"",null,2]
[{"$f":"HYPERLINK(\"#'\"&Helper_Benamingen!$A57&\"'!A1\", Helper_Benamingen!B57)","v":"Loslating distale component"},"looseningDistalComponent","Reden voor revisie",0,"","",null,"",null,"",null,"",null,"",null,"",null,"",null,2]
[{"$f":"HYPERLINK(\"#'\"&Helper_Benamingen!$A58&\"'!A1\", Helper_Benamingen!B58)","v":"Symptomatische MoM articulatie"},"symptomaticMomBearing","Reden voor revisie",0,"","",null,2,null,"",null,"",null,"",null,"",null,"",null,""]
[{"$f":"HYPERLINK(\"#'\"&Helper_Benamingen!$A59&\"'!A1\", Helper_Benamingen!B59)","v":"Progressie van artrose (partiële knieprothese)"},"progressionOsteoarthritis","Reden voor revisie",0,"","",null,"",null,2,null,"",null,"",null,"",null,"",null,""]
[{"$f":"HYPERLINK(\"#'\"&Helper_Benamingen!$A60&\"'!A1\", Helper_Benamingen!B60)","v":"Progressie van glenoïd artrose"},"progressionGlenoidOsteoarthritis","Reden voor revisie",0,"","",null,"",null,"",null,"",null,2,null,"",null,"",null,""]
[{"$f":"HYPERLINK(\"#'\"&Helper_Benamingen!$A61&\"'!A1\", Helper_Benamingen!B61)","v":"Pijn"},"pain","Reden voor revisie",0,"","",null,"",null,2,null,"",null,"",null,"",null,"",null,""]
[{"$f":"HYPERLINK(\"#'\"&Helper_Benamingen!$A62&\"'!A1\", Helper_Benamingen!B62)","v":"Cystevorming"},"cysteFormation","Reden voor revisie",0,"","",null,"",null,"",null,2,null,"",null,"",null,"",null,""]
[{"$f":"HYPERLINK(\"#'\"&Helper_Benamingen!$A63&\"'!A1\", Helper_Benamingen!B63)","v":"Mechanische complicatie radiuskopprothese"},"mechComplRadialHead","Reden voor revisie",0,"","",null,"",null,"",null,"",null,"",null,2,null,"",null,""]
[{"$f":"HYPERLINK(\"#'\"&Helper_Benamingen!$A64&\"'!A1\", Helper_Benamingen!B64)","v":"Botresorptie rondom radiuscomponent"},"boneResorptionRadialComp","Reden voor revisie",0,"","",null,"",null,"",null,"",null,"",null,"",null,2,null,""]
[{"$f":"HYPERLINK(\"#'\"&Helper_Benamingen!$A65&\"'!A1\", Helper_Benamingen!B65)","v":"Botresorptie rondom ulnacomponent"},"boneResorptionUlnarComp","Reden voor revisie",0,"","",null,"",null,"",null,"",null,"",null,"",null,2,null,""]
[{"$f":"HYPERLINK(\"#'\"&Helper_Benamingen!$A66&\"'!A1\", Helper_Benamingen!B66)","v":"Botresorptie rondom carpaalcomponent"},"boneResorptionCarpalComp","Reden voor revisie",0,"","",null,"",null,"",null,"",null,"",null,"",null,2,null,""]
[{"$f":"HYPERLINK(\"#'\"&Helper_Benamingen!$A67&\"'!A1\", Helper_Benamingen!B67)","v":"Botresorptie rondom proximale component"},"boneResorptionProximal","Reden voor revisie",0,"","",null,"",null,"",null,"",null,"",null,"",null,"",null,2]
[{"$f":"HYPERLINK(\"#'\"&Helper_Benamingen!$A68&\"'!A1\", Helper_Benamingen!B68)","v":"Botresorptie rondom distale component"},"boneResorptionDistal","Reden voor revisie",0,"","",null,"",null,"",null,"",null,"",null,"",null,"",null,2]
[{"$f":"HYPERLINK(\"#'\"&Helper_Benamingen!$A69&\"'!A1\", Helper_Benamingen!B69)","v":"Status na heupprothese-verwijdering (Girdlestone)"},"revisionAfterHipRemoval","Reden voor revisie",0,"","",null,2,null,"",null,"",null,"",null,"",null,"",null,""]
[{"$f":"HYPERLINK(\"#'\"&Helper_Benamingen!$A70&\"'!A1\", Helper_Benamingen!B70)","v":"Status na knieprotheseverwijdering"},"revisionAfterKneeRemoval","Reden voor revisie",0,"","",null,"",null,2,null,"",null,"",null,"",null,"",null,""]
[{"$f":"HYPERLINK(\"#'\"&Helper_Benamingen!$A71&\"'!A1\", Helper_Benamingen!B71)","v":"Status na enkelprotheseverwijdering"},"revisionAfterAnkleRemoval","Reden voor revisie",0,"","",null,"",null,"",null,2,null,"",null,"",null,"",null,""]
[{"$f":"HYPERLINK(\"#'\"&Helper_Benamingen!$A72&\"'!A1\", Helper_Benamingen!B72)","v":"Status na schouderprotheseverwijdering"},"revisionAfterShoulderRemoval","Reden voor revisie",0,"","",null,"",null,"",null,"",null,2,null,"",null,"",null,""]
[{"$f":"HYPERLINK(\"#'\"&Helper_Benamingen!$A73&\"'!A1\", Helper_Benamingen!B73)","v":"Status na elleboogprotheseverwijdering"},"revisionAfterElbowRemoval","Reden voor revisie",0,"","",null,"",null,"",null,"",null,"",null,2,null,"",null,""]
[{"$f":"HYPERLINK(\"#'\"&Helper_Benamingen!$A74&\"'!A1\", Helper_Benamingen!B74)","v":"Status na polsprotheseverwijdering"},"revisionAfterWristRemoval","Reden voor revisie",0,"","",null,"",null,"",null,"",null,"",null,"",null,2,null,""]
[{"$f":"HYPERLINK(\"#'\"&Helper_Benamingen!$A75&\"'!A1\", Helper_Benamingen!B75)","v":"Status na vingerprotheseverwijdering"},"revisionAfterFingerRemoval","Reden voor revisie",0,"","",null,"",null,"",null,"",null,"",null,"",null,"",null,2]
[{"$f":"HYPERLINK(\"#'\"&Helper_Benamingen!$A76&\"'!A1\", Helper_Benamingen!B76)","v":"Andere reden voor revisie"},"otherReasonForRevision","Reden voor revisie",0,"","",null,2,null,2,null,2,null,2,null,2,null,2,null,2]
[{"$f":"HYPERLINK(\"#'\"&Helper_Benamingen!$A77&\"'!A1\", Helper_Benamingen!B77)","v":"Andere reden voor revisie, specificeer"},"reasonRevisionOther","Reden voor revisie",0,"","",null,2,null,2,null,2,null,2,null,2,null,2,null,2]
[{"$f":"HYPERLINK(\"#'\"&Helper_Benamingen!$A78&\"'!A1\", Helper_Benamingen!B78)","v":"Specialisme"},"specialism","Type operatie",0,"","",1,2,"","","","",1,2,1,2,1,2,1,2]
[{"$f":"HYPERLINK(\"#'\"&Helper_Benamingen!$A79&\"'!A1\", Helper_Benamingen!B79)","v":"BIG hoofdoperateur"},"surgeonCode","Type operatie",0,"","",1,2,1,2,1,2,1,2,1,2,1,2,1,2]
[{"$f":"HYPERLINK(\"#'\"&Helper_Benamingen!$A80&\"'!A1\", Helper_Benamingen!B80)","v":"BIG assisterend chirurg"},"assistantSurgeonCode","Type operatie",0,"","",1,2,1,2,1,2,1,2,1,2,1,2,1,2]
[{"$f":"HYPERLINK(\"#'\"&Helper_Benamingen!$A81&\"'!A1\", Helper_Benamingen!B81)","v":"Type prothese"},"prosthesisType","Type operatie",0,"","",1,null,1,null,1,null,1,null,1,null,1,null,"",""]
[{"$f":"HYPERLINK(\"#'\"&Helper_Benamingen!$A82&\"'!A1\", Helper_Benamingen!B82)","v":"Ander type prothese, specificeer"},"prosthesisOther","Type operatie",0,"","",1,null,1,null,1,null,1,null,1,null,1,null,"",""]
[{"$f":"HYPERLINK(\"#'\"&Helper_Benamingen!$A83&\"'!A1\", Helper_Benamingen!B83)","v":"Indien unicondylair, zijde prothese"},"unicondylar","Type operatie",0,"","","","",1,2,"","","","","","","","","",""]
[{"$f":"HYPERLINK(\"#'\"&Helper_Benamingen!$A84&\"'!A1\", Helper_Benamingen!B84)","v":"Plaatsing patellacomponent"},"patellaComponent","Type operatie",0,"","","","",1,null,"","","","","","","","","",""]
[{"$f":"HYPERLINK(\"#'\"&Helper_Benamingen!$A85&\"'!A1\", Helper_Benamingen!B85)","v":"Radiuskopcomponent geplaatst"},"radialHeadComp","Type operatie",0,"","","","","","","","","","",1,null,"","","",""]
[{"$f":"HYPERLINK(\"#'\"&Helper_Benamingen!$A86&\"'!A1\", Helper_Benamingen!B86)","v":"Prothese gelinkt"},"prosthesisLinked","Type operatie",0,"","","","","","","","","","",1,null,"","","",""]
["Gereviseerde prothese","revisedProsthesis","Type operatie",0,"",null,"","","","","","",null,2,"","","","","",""]
["Type humerale component van gereviseerde prothese","humeralComponent","Type operatie",0,"",null,"","","","","","",null,2,"","","","","",""]
[{"$f":"HYPERLINK(\"#'\"&Helper_Benamingen!$A89&\"'!A1\", Helper_Benamingen!B89)","v":"Type revisie"},"revisionType","Type operatie",0,"","",null,2,null,2,null,2,null,2,null,2,null,2,null,2]
[{"$f":"HYPERLINK(\"#'\"&Helper_Benamingen!$A90&\"'!A1\", Helper_Benamingen!B90)","v":"Ander type revisie, specificeer"},"revisionOther","Type operatie",0,"","",null,2,null,2,null,2,null,2,null,2,null,2,null,2]
[{"$f":"HYPERLINK(\"#'\"&Helper_Benamingen!$A91&\"'!A1\", Helper_Benamingen!B91)","v":"Conversie naar totale heupprothese"},"conversionToTotalHip","Type operatie",0,"","",null,2,"","","","","","","","","","","",""]
[{"$f":"HYPERLINK(\"#'\"&Helper_Benamingen!$A92&\"'!A1\", Helper_Benamingen!B92)","v":"Amputatie"},"amputation","Type operatie",0,"","","","",null,2,null,2,null,2,null,2,null,2,null,2]
[{"$f":"HYPERLINK(\"#'\"&Helper_Benamingen!$A93&\"'!A1\", Helper_Benamingen!B93)","v":"Conversie naar totale knieprothese"},"conversionTotalKnee","Type operatie",0,"","","","",null,2,"","","","","","","","","",""]
[{"$f":"HYPERLINK(\"#'\"&Helper_Benamingen!$A94&\"'!A1\", Helper_Benamingen!B94)","v":"Conversie van hemi naar totale schouderprothese"},"conversionHemiToTotal","Type operatie",0,"","","","","","","","",null,2,"","","","","",""]
[{"$f":"HYPERLINK(\"#'\"&Helper_Benamingen!$A95&\"'!A1\", Helper_Benamingen!B95)","v":"Conversie van totale naar hemischouderprothese"},"conversionTotalToHemi","Type operatie",0,"","","","","","","","",null,2,"","","","","",""]
[{"$f":"HYPERLINK(\"#'\"&Helper_Benamingen!$A96&\"'!A1\", Helper_Benamingen!B96)","v":"Conversie naar totale elleboogprothese"},"conversionToTotalElbow","Type operatie",0,"","","","","","","","","","",null,2,"","","",""]
[{"$f":"HYPERLINK(\"#'\"&Helper_Benamingen!$A97&\"'!A1\", Helper_Benamingen!B97)","v":"Patellacomponent (bij)geplaatst"},"patellaComponent","Type operatie",0,"","","","",null,2,"","","","","","","","","",""]
[{"$f":"HYPERLINK(\"#'\"&Helper_Benamingen!$A98&\"'!A1\", Helper_Benamingen!B98)","v":"Unicompartimentele prothese  bijgeplaatst"},"uniProsthesisAdded","Type operatie",0,"","","","",null,2,"","","","","","","","","",""]
[{"$f":"HYPERLINK(\"#'\"&Helper_Benamingen!$A99&\"'!A1\", Helper_Benamingen!B99)","v":"VKB functioneel intact"},"anteriorCrucLig","Type operatie",0,"","","","",null,2,"","","","","","","","","",""]
[{"$f":"HYPERLINK(\"#'\"&Helper_Benamingen!$A100&\"'!A1\", Helper_Benamingen!B100)","v":"Radiuskopresectie"},"radialHeadResection","Type operatie",0,"","","","","","","","","","",null,2,"","","",""]
[{"$f":"HYPERLINK(\"#'\"&Helper_Benamingen!$A101&\"'!A1\", Helper_Benamingen!B101)","v":"Linking ulnar cap"},"ulnarCap","Type operatie",0,"","","","","","","","","","",null,2,"","","",""]
[{"$f":"HYPERLINK(\"#'\"&Helper_Benamingen!$A102&\"'!A1\", Helper_Benamingen!B102)","v":"Acetabulumcomponent gereviseerd"},"acetabulumRevised","Type operatie",0,"","",null,2,"","","","","","","","","","","",""]
[{"$f":"HYPERLINK(\"#'\"&Helper_Benamingen!$A103&\"'!A1\", Helper_Benamingen!B103)","v":"Inlay/lager gereviseerd"},"inlayRevised","Type operatie",0,"","",null,2,null,null,null,null,null,null,null,null,null,null,"",""]
[{"$f":"HYPERLINK(\"#'\"&Helper_Benamingen!$A104&\"'!A1\", Helper_Benamingen!B104)","v":"Femurkopcomponent gereviseerd"},"headRevised","Type operatie",0,"","",null,2,null,"",null,"","","","","","","","",""]
[{"$f":"HYPERLINK(\"#'\"&Helper_Benamingen!$A105&\"'!A1\", Helper_Benamingen!B105)","v":"Femurcomponent gereviseerd"},"femurRevised","Type operatie",0,"","",null,2,null,2,null,"","","","","","","","",""]
[{"$f":"HYPERLINK(\"#'\"&Helper_Benamingen!$A106&\"'!A1\", Helper_Benamingen!B106)","v":"Tibiacomponent gereviseerd"},"tibiaRevised","Type operatie",0,"","",null,"",null,2,null,2,"","","","","","","",""]
[{"$f":"HYPERLINK(\"#'\"&Helper_Benamingen!$A107&\"'!A1\", Helper_Benamingen!B107)","v":"Inlay gereviseerd"},"inlayRevised","Type operatie",0,"","",null,null,null,2,null,2,"","","","",null,2,"",""]
[{"$f":"HYPERLINK(\"#'\"&Helper_Benamingen!$A108&\"'!A1\", Helper_Benamingen!B108)","v":"Patellacomponent gereviseerd"},"patellaRevised","Type operatie",0,"","","","",null,2,null,"","","","","","","","",""]
[{"$f":"HYPERLINK(\"#'\"&Helper_Benamingen!$A109&\"'!A1\", Helper_Benamingen!B109)","v":"Taluscomponent gereviseerd"},"talusRevised","Type operatie",0,"","","","","","",null,2,"","","","","","","",""]
[{"$f":"HYPERLINK(\"#'\"&Helper_Benamingen!$A110&\"'!A1\", Helper_Benamingen!B110)","v":"Humeruscomponent gereviseerd"},"humerusRevised","Type operatie",0,"","","","","","","","",null,2,null,2,"","","",""]
[{"$f":"HYPERLINK(\"#'\"&Helper_Benamingen!$A111&\"'!A1\", Helper_Benamingen!B111)","v":"Humeruskop/humerale liner gereviseerd"},"humeralHeadRevised","Type operatie",0,"","","","","","","","",null,2,"","","","","",""]
[{"$f":"HYPERLINK(\"#'\"&Helper_Benamingen!$A112&\"'!A1\", Helper_Benamingen!B112)","v":"Glenoïdcup/glenosfeer gereviseerd"},"glenoidCupGlenosphereRevised","Type operatie",0,"","","","","","","","",null,2,"","","","","",""]
[{"$f":"HYPERLINK(\"#'\"&Helper_Benamingen!$A113&\"'!A1\", Helper_Benamingen!B113)","v":"Metafyse/taper gereviseerd"},"metaphysisTaperRevised","Type operatie",0,"","","","","","","","",null,2,"","","","","",""]
[{"$f":"HYPERLINK(\"#'\"&Helper_Benamingen!$A114&\"'!A1\", Helper_Benamingen!B114)","v":"Glenoïd liner/baseplate gereviseerd"},"glenoidLinerBaseplateRevised","Type operatie",0,"","","","","","","","",null,2,"","","","","",""]
[{"$f":"HYPERLINK(\"#'\"&Helper_Benamingen!$A116&\"'!A1\", Helper_Benamingen!B116)","v":"Radiuscomponent gereviseerd"},"radiusRevised","Type operatie",0,"","","","","","","","","","",null,2,null,2,"",""]
[{"$f":"HYPERLINK(\"#'\"&Helper_Benamingen!$A117&\"'!A1\", Helper_Benamingen!B117)","v":"Ulnacomponent gereviseerd"},"ulnaRevised","Type operatie",0,"","","","","","","","","","",null,2,null,2,"",""]
[{"$f":"HYPERLINK(\"#'\"&Helper_Benamingen!$A118&\"'!A1\", Helper_Benamingen!B118)","v":"Carpaalcomponent gereviseerd"},"carpalRevised ","Type operatie",0,"","","","","","","","","","","","",null,2,"",""]
[{"$f":"HYPERLINK(\"#'\"&Helper_Benamingen!$A119&\"'!A1\", Helper_Benamingen!B119)","v":"Proximale component gereviseerd"},"proximalComponentRevised","Type operatie",0,"","","","","","","","","","","","","","",null,2]
[{"$f":"HYPERLINK(\"#'\"&Helper_Benamingen!$A120&\"'!A1\", Helper_Benamingen!B120)","v":"Distale component gereviseerd"},"distalComponentRevised","Type operatie",0,"","","","","","","","","","","","","","",null,2]
[{"$f":"HYPERLINK(\"#'\"&Helper_Benamingen!$A121&\"'!A1\", Helper_Benamingen!B121)","v":"Benadering"},"approach","Operatiekenmerken",0,"","",1,null,1,null,1,null,1,null,1,2,1,null,1]
[{"$f":"HYPERLINK(\"#'\"&Helper_Benamingen!$A122&\"'!A1\", Helper_Benamingen!B122)","v":"Andere benadering, specificeer"},"approachOther","Operatiekenmerken ",0,"","",1,null,1,null,1,null,1,null,1,2,1,null,1]
[{"$f":"HYPERLINK(\"#'\"&Helper_Benamingen!$A123&\"'!A1\", Helper_Benamingen!B123)","v":"(Correctie) osteotomie uitgevoerd"},"osteotomyPerformed","Operatiekenmerken ",0,"","",1,null,"","","","","","","","","","","",""]
[{"$f":"HYPERLINK(\"#'\"&Helper_Benamingen!$A124&\"'!A1\", Helper_Benamingen!B124)","v":"Osteosynthese uitgevoerd"},"osteosynthesisPerformed","Operatiekenmerken ",0,"","",1,null,"","","","","","","","","","","",""]
[{"$f":"HYPERLINK(\"#'\"&Helper_Benamingen!$A125&\"'!A1\", Helper_Benamingen!B125)","v":"Tuberositas osteotomie uitgevoerd"},"tuberositasOsteotomy","Operatiekenmerken ",0,"","","","",1,null,"","",null,null,"","","","","",""]
[{"$f":"HYPERLINK(\"#'\"&Helper_Benamingen!$A126&\"'!A1\", Helper_Benamingen!B126)","v":"Mediale malleolus osteotomie uitgevoerd"},"medialMalleolarOsteotomy","Operatiekenmerken ",0,"","","","","","",1,null,"","","","","","","",""]
[{"$f":"HYPERLINK(\"#'\"&Helper_Benamingen!$A127&\"'!A1\", Helper_Benamingen!B127)","v":"Achillespeesverlenging uitgevoerd"},"achillesTendonLengthening","Operatiekenmerken ",0,"","","","","","",1,null,"","","","","","","",""]
[{"$f":"HYPERLINK(\"#'\"&Helper_Benamingen!$A128&\"'!A1\", Helper_Benamingen!B128)","v":"Ligament reconstructie uitgevoerd"},"ligamentReconstruction","Operatiekenmerken ",0,"","","","","","",1,null,"","","","","","",1]
[{"$f":"HYPERLINK(\"#'\"&Helper_Benamingen!$A129&\"'!A1\", Helper_Benamingen!B129)","v":"Osteotomie van het tuberculum minus uitgevoerd"},"tuberositasOsteotomy","Operatiekenmerken ",0,"","","","",null,null,"","",1,null,"","","","","",""]
[{"$f":"HYPERLINK(\"#'\"&Helper_Benamingen!$A130&\"'!A1\", Helper_Benamingen!B130)","v":"Acromioplastiek uitgevoerd"},"acromioplasty","Operatiekenmerken ",0,"","","","","","","","",1,null,"","","","","",""]
[{"$f":"HYPERLINK(\"#'\"&Helper_Benamingen!$A131&\"'!A1\", Helper_Benamingen!B131)","v":"Cuff reconstructie uitgevoerd"},"cuffReconstruction","Operatiekenmerken ",0,"","","","","","","","",1,null,"","","","","",""]
[{"$f":"HYPERLINK(\"#'\"&Helper_Benamingen!$A132&\"'!A1\", Helper_Benamingen!B132)","v":"Distale clavicula resectie uitgevoerd"},"distalClavicleResection","Operatiekenmerken ",0,"","","","","","","","",1,null,"","","","","",""]
[{"$f":"HYPERLINK(\"#'\"&Helper_Benamingen!$A133&\"'!A1\", Helper_Benamingen!B133)","v":"LCL losgemaakt"},"lclReleased","Operatiekenmerken ",0,"","","","","","","","","","",1,2,"","","",""]
[{"$f":"HYPERLINK(\"#'\"&Helper_Benamingen!$A134&\"'!A1\", Helper_Benamingen!B134)","v":"Decompressie ulnaire zenuw"},"ulnarNerveRelease","Operatiekenmerken ",0,"","","","","","","","","","",1,2,"","","",""]
[{"$f":"HYPERLINK(\"#'\"&Helper_Benamingen!$A135&\"'!A1\", Helper_Benamingen!B135)","v":"Transpositie ulnaire zenuw"},"ulnarNerveTransposition","Operatiekenmerken ",0,"","","","","","","","","","",1,2,"","","",""]
[{"$f":"HYPERLINK(\"#'\"&Helper_Benamingen!$A136&\"'!A1\", Helper_Benamingen!B136)","v":"Weke delen stabilisatie"},"softTissuesStabilisation","Operatiekenmerken ",0,"","","","","","","","","","","","",1,null,1]
[{"$f":"HYPERLINK(\"#'\"&Helper_Benamingen!$A137&\"'!A1\", Helper_Benamingen!B137)","v":"Andere weke delen stabilisatie, specificeer"},"softTissuesStabilisationOther","Operatiekenmerken ",0,"","","","","","","","","","","","",1,null,1]
[{"$f":"HYPERLINK(\"#'\"&Helper_Benamingen!$A138&\"'!A1\", Helper_Benamingen!B138)","v":"Darrach procedure uitgevoerd"},"darrachProcedure","Operatiekenmerken ",0,"","","","","","","","","","","","",1,null,"",""]
[{"$f":"HYPERLINK(\"#'\"&Helper_Benamingen!$A139&\"'!A1\", Helper_Benamingen!B139)","v":"Ulna osteotomie uitgevoerd"},"ulnaOsteotomy","Operatiekenmerken ",0,"","","","","","","","","","","","",1,null,"",""]
[{"$f":"HYPERLINK(\"#'\"&Helper_Benamingen!$A140&\"'!A1\", Helper_Benamingen!B140)","v":"Proximale rij resectie uitgevoerd"},"proximalRowResection","Operatiekenmerken ",0,"","","","","","","","","","","","",1,null,"",""]
[{"$f":"HYPERLINK(\"#'\"&Helper_Benamingen!$A141&\"'!A1\", Helper_Benamingen!B141)","v":"Andere botprocedure, specificeer"},"additionalBoneProceduresOther","Operatiekenmerken ",0,"","","","","","","","","","","","",1,null,"",""]
[{"$f":"HYPERLINK(\"#'\"&Helper_Benamingen!$A142&\"'!A1\", Helper_Benamingen!B142)","v":"Patient Specific Instrumentation (PSI) gebruikt"},"psi","Operatiekenmerken ",0,"","",1,2,1,2,1,2,1,2,1,2,"","","",""]
[{"$f":"HYPERLINK(\"#'\"&Helper_Benamingen!$A143&\"'!A1\", Helper_Benamingen!B143)","v":"Navigatie gebruikt"},"navigation","Operatiekenmerken ",0,"","",1,2,1,2,1,2,1,2,1,2,"","","",""]
[{"$f":"HYPERLINK(\"#'\"&Helper_Benamingen!$A144&\"'!A1\", Helper_Benamingen!B144)","v":"Doorlichting gebruikt"},"screening","Operatiekenmerken ",0,"","",1,2,"","","","","","","","","","","",""]
[{"$f":"HYPERLINK(\"#'\"&Helper_Benamingen!$A145&\"'!A1\", Helper_Benamingen!B145)","v":"Robotassistentie gebruikt"},"robotAssistance","Operatiekenmerken ",0,"","",1,2,1,2,1,2,1,2,1,2,"","","",""]
[{"$f":"HYPERLINK(\"#'\"&Helper_Benamingen!$A146&\"'!A1\", Helper_Benamingen!B146)","v":"Botgraft gebruikt"},"bonegraft","Operatiekenmerken ",0,"","",1,2,1,2,1,2,1,2,1,2,1,2,1,2]
[{"$f":"HYPERLINK(\"#'\"&Helper_Benamingen!$A147&\"'!A1\", Helper_Benamingen!B147)","v":"Patellectomie uitgevoerd"},"patellectomy","Operatiekenmerken ",0,"","","","",null,2,"","","","","","","","","",""]
[{"$f":"HYPERLINK(\"#'\"&Helper_Benamingen!$A148&\"'!A1\", Helper_Benamingen!B148)","v":"Artrodese uitgevoerd"},"arthrodesisPerformed","Operatiekenmerken ",0,"","","","",null,2,null,2,"","","","",null,2,null,2]
[{"$f":"HYPERLINK(\"#'\"&Helper_Benamingen!$A149&\"'!A1\", Helper_Benamingen!B149)","v":"Onder bloedleegte uitgevoerd"},"surgicalTourniquet","Operatiekenmerken ",0,"","","","",1,2,"","","","","","","","","",""]
[{"$f":"HYPERLINK(\"#'\"&Helper_Benamingen!$A150&\"'!A1\", Helper_Benamingen!B150)","v":"Voorgaande operaties"},"previousOperations","Voorgaande operaties ",0,"","",1,null,1,null,1,null,1,null,1,null,1,null,1]
[{"$f":"HYPERLINK(\"#'\"&Helper_Benamingen!$A151&\"'!A1\", Helper_Benamingen!B151)","v":"Osteosynthese"},"osteosynthesis","Voorgaande operaties ",0,"","",1,null,1,null,1,null,1,null,1,null,"","",""]
[{"$f":"HYPERLINK(\"#'\"&Helper_Benamingen!$A152&\"'!A1\", Helper_Benamingen!B152)","v":"Osteotomie"},"osteotomy","Voorgaande operaties ",0,"","",1,null,1,null,1,null,"","","","","","",""]
[{"$f":"HYPERLINK(\"#'\"&Helper_Benamingen!$A153&\"'!A1\", Helper_Benamingen!B153)","v":"Artrodese"},"arthrodesis","Voorgaande operaties ",0,"","",1,null,"",null,1,null,"","","","","","",1]
[{"$f":"HYPERLINK(\"#'\"&Helper_Benamingen!$A154&\"'!A1\", Helper_Benamingen!B154)","v":"Girdlestone"},"girdlestone","Voorgaande operaties ",0,"","",1,null,"",null,"",null,"","","","","","","",""]
[{"$f":"HYPERLINK(\"#'\"&Helper_Benamingen!$A155&\"'!A1\", Helper_Benamingen!B155)","v":"Artroscopie"},"arthroscopy","Voorgaande operaties ",0,"","",1,null,1,null,1,null,"","",1,null,"","","",""]
[{"$f":"HYPERLINK(\"#'\"&Helper_Benamingen!$A156&\"'!A1\", Helper_Benamingen!B156)","v":"Open meniscectomie"},"meniscectomy","Voorgaande operaties ",0,"","","",null,1,null,"",null,"","","","","","","",""]
[{"$f":"HYPERLINK(\"#'\"&Helper_Benamingen!$A157&\"'!A1\", Helper_Benamingen!B157)","v":"Voorste kruisband reconstructie"},"aclReconstruction","Voorgaande operaties ",0,"","","","",1,null,"",null,"","","","","","","",""]
[{"$f":"HYPERLINK(\"#'\"&Helper_Benamingen!$A158&\"'!A1\", Helper_Benamingen!B158)","v":"Synovectomie"},"synovectomy","Voorgaande operaties ",0,"","","","",1,null,1,null,"","","","","","","",""]
[{"$f":"HYPERLINK(\"#'\"&Helper_Benamingen!$A159&\"'!A1\", Helper_Benamingen!B159)","v":"Patella realignment procedure"},"patellaRealignment","Voorgaande operaties ",0,"","","","",1,null,"",null,"","","","","","","",""]
[{"$f":"HYPERLINK(\"#'\"&Helper_Benamingen!$A160&\"'!A1\", Helper_Benamingen!B160)","v":"Knie distractie"},"kneeDistraction","Voorgaande operaties ",0,"","","","",1,null,"",null,"","","","","","","",""]
[{"$f":"HYPERLINK(\"#'\"&Helper_Benamingen!$A161&\"'!A1\", Helper_Benamingen!B161)","v":"Behandeling osteochondraal botdefect"},"ocdTreatment","Voorgaande operaties ",0,"","","","","","",1,null,"","","","","","","",""]
[{"$f":"HYPERLINK(\"#'\"&Helper_Benamingen!$A162&\"'!A1\", Helper_Benamingen!B162)","v":"Ligament reconstructie"},"previousOperationsLigamentReconstruction","Voorgaande operaties ",0,"","","","","","",1,null,"","","","","","","",""]
[{"$f":"HYPERLINK(\"#'\"&Helper_Benamingen!$A163&\"'!A1\", Helper_Benamingen!B163)","v":"Achtervoetchirurgie"},"hindfootSurgery","Voorgaande operaties ",0,"","","","","","",1,null,"","","","","","","",""]
[{"$f":"HYPERLINK(\"#'\"&Helper_Benamingen!$A164&\"'!A1\", Helper_Benamingen!B164)","v":"Voorvoetchirurgie"},"forefootSurgery","Voorgaande operaties ",0,"","","","","","",1,null,"","","","","","","",""]
[{"$f":"HYPERLINK(\"#'\"&Helper_Benamingen!$A165&\"'!A1\", Helper_Benamingen!B165)","v":"Acromioplastiek"},"prevAcromioplasty","Voorgaande operaties ",0,"","","","","","","","",1,null,"","","","","",""]
[{"$f":"HYPERLINK(\"#'\"&Helper_Benamingen!$A166&\"'!A1\", Helper_Benamingen!B166)","v":"Herstellen van de rotator cuff"},"rotatorCuffRepair","Voorgaande operaties ",0,"","","","","","","","",1,null,"","","","","",""]
[{"$f":"HYPERLINK(\"#'\"&Helper_Benamingen!$A167&\"'!A1\", Helper_Benamingen!B167)","v":"Distale clavicula resectie"},"prevDistalClavicleResection","Voorgaande operaties ",0,"","","","","","","","",1,null,"","","","","",""]
[{"$f":"HYPERLINK(\"#'\"&Helper_Benamingen!$A168&\"'!A1\", Helper_Benamingen!B168)","v":"Stabilisatieprocedure"},"stabilisationProcedure","Voorgaande operaties ",0,"","","","","","","","",1,null,"","","","","",""]
[{"$f":"HYPERLINK(\"#'\"&Helper_Benamingen!$A169&\"'!A1\", Helper_Benamingen!B169)","v":"Tenotomie bicepspees"},"tenotomyBiceps","Voorgaande operaties ",0,"","","","","","","","",1,null,"","","","","",""]
[{"$f":"HYPERLINK(\"#'\"&Helper_Benamingen!$A170&\"'!A1\", Helper_Benamingen!B170)","v":"Tenodesis bicepspees"},"tenodesisBiceps","Voorgaande operaties ",0,"","","","","","","","",1,null,"","","","","",""]
[{"$f":"HYPERLINK(\"#'\"&Helper_Benamingen!$A171&\"'!A1\", Helper_Benamingen!B171)","v":"Laterale artrotomie"},"arthrotomyLateral","Voorgaande operaties ",0,"","","","","","","","","","",1,null,"","","",""]
[{"$f":"HYPERLINK(\"#'\"&Helper_Benamingen!$A172&\"'!A1\", Helper_Benamingen!B172)","v":"Mediale artrotomie"},"arthrotomyMedial","Voorgaande operaties ",0,"","","","","","","","","","",1,null,"","","",""]
[{"$f":"HYPERLINK(\"#'\"&Helper_Benamingen!$A173&\"'!A1\", Helper_Benamingen!B173)","v":"Posterieure artrotomie"},"arthrotomyPosterior","Voorgaande operaties ",0,"","","","","","","","","","",1,null,"","","",""]
[{"$f":"HYPERLINK(\"#'\"&Helper_Benamingen!$A174&\"'!A1\", Helper_Benamingen!B174)","v":"Decompressie ulnaire zenuw (vo)"},"decompressionUlnarNerve","Voorgaande operaties ",0,"","","","","","","","","","",1,null,"","","",""]
[{"$f":"HYPERLINK(\"#'\"&Helper_Benamingen!$A175&\"'!A1\", Helper_Benamingen!B175)","v":"Transpositie ulnaire zenuw (vo)"},"transpositionUlnarNerve","Voorgaande operaties ",0,"","","","","","","","","","",1,null,"","","",""]
[{"$f":"HYPERLINK(\"#'\"&Helper_Benamingen!$A176&\"'!A1\", Helper_Benamingen!B176)","v":"Radiuskopresectie (vo)"},"radialHeadResection","Voorgaande operaties ",0,"","","","","","","","","","",1,null,"","","",""]
[{"$f":"HYPERLINK(\"#'\"&Helper_Benamingen!$A177&\"'!A1\", Helper_Benamingen!B177)","v":"Plaat- of schroefverwijdering"},"plateScrewRemoval","Voorgaande operaties ",0,"","","","","","","","","","",1,null,"","","",""]
[{"$f":"HYPERLINK(\"#'\"&Helper_Benamingen!$A178&\"'!A1\", Helper_Benamingen!B178)","v":"Osteosynthese radius"},"osteosynthesisRadius","Voorgaande operaties ",0,"","","","","","","","","","","","",1,null,"",""]
[{"$f":"HYPERLINK(\"#'\"&Helper_Benamingen!$A179&\"'!A1\", Helper_Benamingen!B179)","v":"Osteosynthese ulna"},"osteosynthesisUlna","Voorgaande operaties ",0,"","","","","","","","","","","","",1,null,"",""]
[{"$f":"HYPERLINK(\"#'\"&Helper_Benamingen!$A180&\"'!A1\", Helper_Benamingen!B180)","v":"Osteosynthese carpus"},"osteosynthesisCarpus","Voorgaande operaties ",0,"","","","","","","","","","","","",1,null,"",""]
[{"$f":"HYPERLINK(\"#'\"&Helper_Benamingen!$A181&\"'!A1\", Helper_Benamingen!B181)","v":"Correctie osteotomie radius"},"correctionOsteotomyRadius","Voorgaande operaties ",0,"","","","","","","","","","","","",1,null,"",""]
[{"$f":"HYPERLINK(\"#'\"&Helper_Benamingen!$A182&\"'!A1\", Helper_Benamingen!B182)","v":"Correction osteotomy ulna"},"correctionOsteotomyUlna","Voorgaande operaties ",0,"","","","","","","","","","","","",1,null,"",""]
[{"$f":"HYPERLINK(\"#'\"&Helper_Benamingen!$A183&\"'!A1\", Helper_Benamingen!B183)","v":"Proximale rij resectie"},"proximalRowResectionPrev","Voorgaande operaties ",0,"","","","","","","","","","","","",1,null,"",""]
[{"$f":"HYPERLINK(\"#'\"&Helper_Benamingen!$A184&\"'!A1\", Helper_Benamingen!B184)","v":"Totale artrodese"},"totalArthrodesis","Voorgaande operaties ",0,"","","","","","","","","","","","",1,null,"",""]
[{"$f":"HYPERLINK(\"#'\"&Helper_Benamingen!$A185&\"'!A1\", Helper_Benamingen!B185)","v":"Partiële artrodese"},"partialArthrodesis","Voorgaande operaties ",0,"","","","","","","","","","","","",1,null,"",""]
[{"$f":"HYPERLINK(\"#'\"&Helper_Benamingen!$A186&\"'!A1\", Helper_Benamingen!B186)","v":"Sauvé-Kapandji"},"sauveKapanji","Voorgaande operaties ",0,"","","","","","","","","","","","",1,null,"",""]
[{"$f":"HYPERLINK(\"#'\"&Helper_Benamingen!$A187&\"'!A1\", Helper_Benamingen!B187)","v":"Ligamentaire reconstructie"},"ligamentaryReconstruction","Voorgaande operaties ",0,"","","","","","","","","","","","",1,null,"",""]
[{"$f":"HYPERLINK(\"#'\"&Helper_Benamingen!$A188&\"'!A1\", Helper_Benamingen!B188)","v":"Interpositie plastiek"},"interpositionArthroplasty","Voorgaande operaties ",0,"","","","","","","","","","","","","","",1]
[{"$f":"HYPERLINK(\"#'\"&Helper_Benamingen!$A189&\"'!A1\", Helper_Benamingen!B189)","v":"Osteosynthese intra-articulaire fractuur"},"osteosynthesisIntraArticularFracture","Voorgaande operaties ",0,"","","","","","","","","","","","","","",1]
[{"$f":"HYPERLINK(\"#'\"&Helper_Benamingen!$A190&\"'!A1\", Helper_Benamingen!B190)","v":"Plaatsing spacer"},"placementSpacer","Voorgaande operaties ",0,"","","","","","","","","","","","","","",1]
[{"$f":"HYPERLINK(\"#'\"&Helper_Benamingen!$A191&\"'!A1\", Helper_Benamingen!B191)","v":"Andere voorgaande operaties"},"previousOperationsOther","Voorgaande operaties ",0,"","",1,null,1,null,1,null,1,null,1,null,1,null,1]
[{"$f":"HYPERLINK(\"#'\"&Helper_Benamingen!$A192&\"'!A1\", Helper_Benamingen!B192)","v":"Andere voorgaande operaties, specificeer"},"previousOperationsSpecify","Voorgaande operaties ",0,"","",1,null,1,null,1,null,1,null,1,null,1,null,1]
[{"$f":"HYPERLINK(\"#'\"&Helper_Benamingen!$A193&\"'!A1\", Helper_Benamingen!B193)","v":"Fixatie"},"fixation","Cement",0,"","",1,2,1,2,1,2,1,2,1,2,1,2,1,2]
[{"$f":"HYPERLINK(\"#'\"&Helper_Benamingen!$A194&\"'!A1\", Helper_Benamingen!B194)","v":"Lavage"},"lavage","Cement",0,"","",1,2,1,2,1,2,1,2,1,2,1,2,"",""]
[{"$f":"HYPERLINK(\"#'\"&Helper_Benamingen!$A195&\"'!A1\", Helper_Benamingen!B195)","v":"Vacuum (mix)"},"vacuumMix","Cement",0,"","",1,2,1,2,"","",1,2,1,2,1,2,"",""]
[{"$f":"HYPERLINK(\"#'\"&Helper_Benamingen!$A196&\"'!A1\", Helper_Benamingen!B196)","v":"Pressurising"},"pressurising","Cement",0,"","",1,2,1,2,"","",1,2,1,2,1,2,"",""]
[{"$f":"HYPERLINK(\"#'\"&Helper_Benamingen!$A197&\"'!A1\", Helper_Benamingen!B197)","v":"Acetabulumcomponent gecementeerd"},"acetabulumCemented","Cement",0,"","",1,2,"","","","","","","","","","","",""]
[{"$f":"HYPERLINK(\"#'\"&Helper_Benamingen!$A198&\"'!A1\", Helper_Benamingen!B198)","v":"Femurcomponent gecementeerd"},"femurCemented","Cement",0,"","",1,2,1,2,"","","","","","","","","",""]
[{"$f":"HYPERLINK(\"#'\"&Helper_Benamingen!$A199&\"'!A1\", Helper_Benamingen!B199)","v":"Cement-in-cement"},"cementInCement","Cement",0,"","",null,2,"","","","","","","","","","","",""]
[{"$f":"HYPERLINK(\"#'\"&Helper_Benamingen!$A200&\"'!A1\", Helper_Benamingen!B200)","v":"Tibiacomponent gecementeerd"},"tibiaCemented","Cement",0,"","","","",1,2,"","","","","","","","","",""]
[{"$f":"HYPERLINK(\"#'\"&Helper_Benamingen!$A201&\"'!A1\", Helper_Benamingen!B201)","v":"Patellacomponent gecementeerd"},"patellaCemented","Cement",0,"","","","",1,2,"","","","","","","","","",""]
[{"$f":"HYPERLINK(\"#'\"&Helper_Benamingen!$A202&\"'!A1\", Helper_Benamingen!B202)","v":"Humeruscomponent gecementeerd"},"humerusCemented","Cement",0,"","","","","","","","",1,2,1,2,"","","",""]
[{"$f":"HYPERLINK(\"#'\"&Helper_Benamingen!$A203&\"'!A1\", Helper_Benamingen!B203)","v":"Glenoïdcomponent gecementeerd"},"glenoidCemented","Cement",0,"","","","","","","","",1,2,"","","","","",""]
[{"$f":"HYPERLINK(\"#'\"&Helper_Benamingen!$A204&\"'!A1\", Helper_Benamingen!B204)","v":"Ulnacomponent gecementeerd"},"ulnaCemented","Cement",0,"","","","","","","","","","",1,2,1,2,"",""]
[{"$f":"HYPERLINK(\"#'\"&Helper_Benamingen!$A205&\"'!A1\", Helper_Benamingen!B205)","v":"Radiuscomponent gecementeerd"},"radiusCemented","Cement",0,"","","","","","","","","","",1,2,1,2,"",""]
[{"$f":"HYPERLINK(\"#'\"&Helper_Benamingen!$A206&\"'!A1\", Helper_Benamingen!B206)","v":"Carpaalcomponent gecementeerd"},"carpalCemented","Cement",0,"","","","","","","","","","","","",1,2,"",""]
[{"$f":"HYPERLINK(\"#'\"&Helper_Benamingen!$A207&\"'!A1\", Helper_Benamingen!B207)","v":"Proximale component gecementeerd"},"proximalCemented","Cement",0,"","","","","","","","","","","","","","",1,2]
[{"$f":"HYPERLINK(\"#'\"&Helper_Benamingen!$A208&\"'!A1\", Helper_Benamingen!B208)","v":"Distale component gecementeerd"},"distalCemented","Cement",0,"","","","","","","","","","","","","","",1,2]
[{"$f":"HYPERLINK(\"#'\"&Helper_Benamingen!$A209&\"'!A1\", Helper_Benamingen!B209)","v":"Productnummer cement 1"},"productNumberCement","Componenten",0,"","",1,2,1,2,1,2,1,2,1,2,1,2,1,2]
[{"$f":"HYPERLINK(\"#'\"&Helper_Benamingen!$A210&\"'!A1\", Helper_Benamingen!B210)","v":"Lotnummer cement 1"},"lotNumberCement","Componenten",0,"","",1,2,1,2,1,2,1,2,1,2,1,2,1,2]
[{"$f":"HYPERLINK(\"#'\"&Helper_Benamingen!$A211&\"'!A1\", Helper_Benamingen!B211)","v":"Productnummer cement 2"},"productNumberCement","Componenten",0,"","",1,2,1,2,1,2,1,2,1,2,1,2,1,2]
[{"$f":"HYPERLINK(\"#'\"&Helper_Benamingen!$A212&\"'!A1\", Helper_Benamingen!B212)","v":"Lotnummer cement 2"},"lotNumberCement","Componenten",0,"","",1,2,1,2,1,2,1,2,1,2,1,2,1,2]
[{"$f":"HYPERLINK(\"#'\"&Helper_Benamingen!$A213&\"'!A1\", Helper_Benamingen!B213)","v":"Productnummer cement 3"},"productNumberCement","Componenten",0,"","",1,2,1,2,1,2,1,2,1,2,1,2,1,2]
[{"$f":"HYPERLINK(\"#'\"&Helper_Benamingen!$A214&\"'!A1\", Helper_Benamingen!B214)","v":"Lotnummer cement 3"},"lotNumberCement","Componenten",0,"","",1,2,1,2,1,2,1,2,1,2,1,2,1,2]
[{"$f":"HYPERLINK(\"#'\"&Helper_Benamingen!$A215&\"'!A1\", Helper_Benamingen!B215)","v":"Productnummer cement 4"},"productNumberCement","Componenten",0,"","",1,2,1,2,1,2,1,2,1,2,1,2,1,2]
[{"$f":"HYPERLINK(\"#'\"&Helper_Benamingen!$A216&\"'!A1\", Helper_Benamingen!B216)","v":"Lotnummer cement 4"},"lotNumberCement","Componenten",0,"","",1,2,1,2,1,2,1,2,1,2,1,2,1,2]
["Productnummer ","productNumberAcetabularComponent1","Componenten",0,"","",1,2,"","","","","","","","","","","",""]
["Lot nummer ","lotNumberAcetabularComponent1","Componenten",0,"","",1,2,"","","","","","","","","","","",""]
["Meer dan 1 acetabulumcomponent?","moreAcetabularComponents","Componenten",0,"","",1,2,"","","","","","","","","","","",""]
["Productnummer ","productNumberAcetabularComponent2","Componenten",0,"","",1,2,"","","","","","","","","","","",""]
["Lot nummer ","lotNumberAcetabularComponent2","Componenten",0,"","",1,2,"","","","","","","","","","","",""]
["Productnummer ","productNumberInlay","Componenten",0,"","",1,2,1,2,"","","","","","","","","",""]
["Lot nummer ","lotNumberInlay","Componenten",0,"","",1,2,1,2,"","","","","","","","","",""]
["Productnummer ","productNumberFemoralComponent1","Componenten",0,"","",1,2,1,2,"","","","","","","","","",""]
["Lot nummer ","lotNumberFemoralComponent1","Componenten",0,"","",1,2,1,2,"","","","","","","","","",""]
["Meer dan 1 femurcomponent?","moreFemoralComponents","Componenten",0,"","",1,2,1,2,"","","","","","","","","",""]
["Productnummer ","productNumberFemoralComponent2","Componenten",0,"","",1,2,1,2,"","","","","","","","","",""]
["Lot nummer ","lotNumberFemoralComponent2","Componenten",0,"","",1,2,1,2,"","","","","","","","","",""]
["Productnummer ","productNumberHead1","Componenten",0,"","",1,2,"","","","","","","","","","","",""]
["Lot nummer ","lotNumberHead1","Componenten",0,"","",1,2,"","","","","","","","","","","",""]
["Meer dan 1 femurkopcomponent?","moreHeads","Componenten",0,"","",1,2,"","","","","","","","","","","",""]
["Productnummer ","productNumberHead2","Componenten",0,"","",1,2,"","","","","","","","","","","",""]
["Lot nummer ","lotNumberHead2","Componenten",0,"","",1,2,"","","","","","","","","","","",""]
["Meer dan 1 femoral component?","moreFemoralComponents","Componenten",0,"","",1,2,1,2,"","","","","","","","","",""]
["Productnummer","productNumberTibiaComponent1","Componenten",0,"","","","",1,2,"","","","","","","","","",""]
["Lot nummer","lotNumberTibiaComponent1","Componenten",0,"","","","",1,2,"","","","","","","","","",""]
["Meer dan 1 tibia component?","moreTibiaComponents","Componenten",0,"","","","",1,2,"","","","","","","","","",""]
["Productnummer","productNumberTibiaComponent2","Componenten",0,"","","","",1,2,"","","","","","","","","",""]
["Lot nummer","lotNumberTibiaComponent2","Componenten",0,"","","","",1,2,"","","","","","","","","",""]
["Productnummer","productNumberPatellaComponent","Componenten",0,"","","","",1,2,"","","","","","","","","",""]
["Lot nummer","lotNumberPatellaComponent","Componenten",0,"","","","",1,2,"","","","","","","","","",""]
["Productnummer","productNumberTibialComponent","Componenten",0,"","","","","","",1,2,"","","","","","","",""]
["Lot nummer","lotNumberTibialComponent","Componenten",0,"","","","","","",1,2,"","","","","","","",""]
["Productnummer","productNumberTalusComponent","Componenten",0,"","","","","","",1,2,"","","","","","","",""]
["Lot nummer","lotNumberTalusComponent","Componenten",0,"","","","","","",1,2,"","","","","","","",""]
["Productnummer","productNumberInlayComponent","Componenten",0,"","","","","","",1,2,"","","","",1,2,"",""]
["Lot nummer","lotNumberInlayComponent","Componenten",0,"","","","","","",1,2,"","","","",1,2,"",""]
["Productnummer ","productNumberHumeralComponent","Componenten",0,"","","","","","","","",1,2,"","","","","",""]
["Lot nummer ","lotNumberHumeralComponent","Componenten",0,"","","","","","","","",1,2,"","","","","",""]
["Productnummer ","productNumberHumeralHead","Componenten",0,"","","","","","","","",1,2,"","","","","",""]
["Lot nummer ","lotNumberHumeralHead","Componenten",0,"","","","","","","","",1,2,"","","","","",""]
["Productnummer ","productNumberGlenoidCup","Componenten",0,"","","","","","","","",1,2,"","","","","",""]
["Lot nummer ","lotNumberGlenoidCup","Componenten",0,"","","","","","","","",1,2,"","","","","",""]
["Productnummer ","productNumberMetaphysealComponent","Componenten",0,"","","","","","","","",1,2,"","","","","",""]
["Lot nummer ","lotNumberMetaphysealComponent","Componenten",0,"","","","","","","","",1,2,"","","","","",""]
["Productnummer ","productNumberGlenoidLiner","Componenten",0,"","","","","","","","",1,2,"","","","","",""]
["Lot nummer ","lotNumberGlenoidLiner","Componenten",0,"","","","","","","","",1,2,"","","","","",""]
["Productnummer ","productNumberHumeralComponent1","Componenten",0,"","","","","","","","","","",1,2,"","","",""]
["Lot nummer ","lotNumberHumeralComponent1","Componenten",0,"","","","","","","","","","",1,2,"","","",""]
["Meer dan 1 humerus component?","moreHumeralComponents","Componenten",0,"","","","","","","","","","",1,2,"","","",""]
["Productnummer ","productNumberHumeralComponent2","Componenten",0,"","","","","","","","","","",1,2,"","","",""]
["Lot nummer ","lotNumberHumeralComponent2","Componenten",0,"","","","","","","","","","",1,2,"","","",""]
["Productnummer ","productNumberUlnarComponent1","Componenten",0,"","","","","","","","","","",1,2,"","","",""]
["Lot nummer ","lotNumberUlnarComponent1","Componenten",0,"","","","","","","","","","",1,2,"","","",""]
["Meer dan 1 ulna component?","moreUlnaComponents","Componenten",0,"","","","","","","","","","",1,2,"","","",""]
["Productnummer ","productNumberUlnarComponent2","Componenten",0,"","","","","","","","","","",1,2,"","","",""]
["Lot nummer ","lotNumberUlnarComponent2","Componenten",0,"","","","","","","","","","",1,2,"","","",""]
["Productnummer ","productNumberRadialHeadComponent","Componenten",0,"","","","","","","","","","",1,2,1,2,"",""]
["Lot nummer ","lotNumberRadialHeadComponent","Componenten",0,"","","","","","","","","","",1,2,1,2,"",""]
["Productnummer ","productNumberRadialStemComponent","Componenten",0,"","","","","","","","","","",1,2,1,2,"",""]
["Lot nummer ","lotNumberRadialStemComponent","Componenten",0,"","","","","","","","","","",1,2,1,2,"",""]
["Productnummer ","productNumberUlnarStemComponent","Componenten",0,"","","","","","","","","","","","",1,2,"",""]
["Lot nummer ","lotNumberUlnarStemComponent","Componenten",0,"","","","","","","","","","","","",1,2,"",""]
["Productnummer ","productNumberUlnarHeadComponent","Componenten",0,"","","","","","","","","","","","",1,2,"",""]
["Lot nummer ","lotNumberUlnarHeadComponent","Componenten",0,"","","","","","","","","","","","",1,2,"",""]
["Productnummer ","productNumberInlayComponent","Componenten",0,"","","","","","",1,2,"","","","",1,2,"",""]
["Lot nummer ","lotNumberInlayComponent","Componenten",0,"","","","","","",1,2,"","","","",1,2,"",""]
["Productnummer ","productNumberCarpalComponent1","Componenten",0,"","","","","","","","","","","","",1,2,"",""]
["Lot nummer ","lotNumberCarpalComponent1","Componenten",0,"","","","","","","","","","","","",1,2,"",""]
["Productnummer ","productNumberCarpalComponent2","Componenten",0,"","","","","","","","","","","","",1,2,"",""]
["Lot nummer ","lotNumberCarpalComponent2","Componenten",0,"","","","","","","","","","","","",1,2,"",""]
["Productnummer ","productNumberCarpalComponent3","Componenten",0,"","","","","","","","","","","","",1,2,"",""]
["Lot nummer ","lotNumberCarpalComponent3","Componenten",0,"","","","","","","","","","","","",1,2,"",""]
["Productnummer ","productNumberProximalStemComponent","Componenten",0,"","","","","","","","","","","","","","",1,2]
["Lot nummer ","lotNumberProximalStemComponent","Componenten",0,"","","","","","","","","","","","","","",1,2]
["Productnummer ","productNumberProximalHeadComponent","Componenten",0,"","","","","","","","","","","","","","",1,2]
["Lot nummer ","lotNumberProximalHeadComponent","Componenten",0,"","","","","","","","","","","","","","",1,2]
["Productnummer ","productNumberDistalStemComponent","Componenten",0,"","","","","","","","","","","","","","",1,2]
["Lot nummer ","lotNumberDistalStemComponent","Componenten",0,"","","","","","","","","","","","","","",1,2]
["Productnummer ","productNumberDistalHeadComponent","Componenten",0,"","","","","","","","","","","","","","",1,2]
["Lot nummer ","lotNumberDistalHeadComponent","Componenten",0,"","","","","","","","","","","","","","",1,2]
["Productnummer (code)","code","Componenten",0,"","",1,2,1,2,1,2,1,2,1,2,1,2,1,2]
["Lot nummer","lotNumber","Componenten",0,"","",1,2,1,2,1,2,1,2,1,2,1,2,1,2]

{"sheet":"Overzicht_DICT_ID","index":2,"n_rows":297,"n_cols":21,"rows_kept":297,"cut":false,"hidden":false,"merged":[]}
["Label NL","Variabelenaam (XML)","Sectie","Verplicht","Patient \nPrimair","Patient \nRevisie","Heup Primair","Heup Revisie","Knie \nPrimair","Knie \nRevisie","Enkel Primair","Enkel Revisie","Schouder Primair","Schouder Revisie","Elleboog Primair","Elleboog Revisie","Pols \nPrimair","Pols \nRevisie","Vinger Primair","Vinger Revisie"]
[null,null,null,null,"Patient","Patient","Heup","Heup","Knie","Knie","Enkel","Enkel","Schouder","Schouder","Elleboog","Elleboog","Pols","Pols","Vinger","Vinger"]
[null,null,null,null,"Primary","Revision","Primary","Revision","Primary","Revision","Primary","Revision","Primary","Revision","Primary","Revision","Primary","Revision","Primary","Revision"]
[{"$f":"HYPERLINK(\"#'\"&Helper_Benamingen!$A2&\"'!A1\", Helper_Benamingen!B2)","v":"LROI nummer"}," ","Index administratie","n.v.t.","","","","","","","","","","","","","","","","",{"$f":"_xlfn.UNIQUE(Table292[[#This Row],[Patient \nPrimair]:[Vinger Revisie]],1)","v":""}]
[{"$f":"HYPERLINK(\"#'\"&Helper_Benamingen!$A3&\"'!A1\", Helper_Benamingen!B3)","v":"Ziekenhuispatiëntnummer"},"patientnumber","Patiënt ",1,"LROI002","LROI002",null,"","","","","","","","","","","","",""]
[{"$f":"HYPERLINK(\"#'\"&Helper_Benamingen!$A4&\"'!A1\", Helper_Benamingen!B4)","v":"Burger Service Nummer "},"bsn","Patiënt",0,"LROI003","LROI003","","","","","","","","","","","","","",""]
[{"$f":"HYPERLINK(\"#'\"&Helper_Benamingen!$A5&\"'!A1\", Helper_Benamingen!B5)","v":"Geslacht"},"gender","Patiënt",1,"LROI004","LROI004","","","","","","","","","","","","","",""]
[{"$f":"HYPERLINK(\"#'\"&Helper_Benamingen!$A6&\"'!A1\", Helper_Benamingen!B6)","v":"Geboortedatum"},"birthdate","Patiënt",1,"LROI005","LROI005","","","","","","","","","","","","","",""]
[{"$f":"HYPERLINK(\"#'\"&Helper_Benamingen!$A7&\"'!A1\", Helper_Benamingen!B7)","v":"Overlijdensdatum"},"deathdate","Patiënt",0,"LROI006","LROI006","","","","","","","","","","","","","",""]
[{"$f":"HYPERLINK(\"#'\"&Helper_Benamingen!$A8&\"'!A1\", Helper_Benamingen!B8)","v":"Ziekenhuisnummer"},"hospitalId","Patiënt","n.v.t.","LROI007","LROI007","","","","","","","","","","","","","",""]
[{"$f":"HYPERLINK(\"#'\"&Helper_Benamingen!$A9&\"'!A1\", Helper_Benamingen!B9)","v":"Operatietype"},"procedureType","Algemene informatie",1,"","","LROI008","LROI008","LROI097","LROI097","LROI197","LROI197","LROI274","LROI274","LROI364","LROI364","LROI458","LROI458","LROI556","LROI556"]
[{"$f":"HYPERLINK(\"#'\"&Helper_Benamingen!$A10&\"'!A1\", Helper_Benamingen!B10)","v":"Operatiedatum"},"procedureDate","Algemene informatie",1,"","","LROI009","LROI009","LROI098","LROI098","LROI198","LROI198","LROI275","LROI275","LROI365","LROI365","LROI459","LROI459","LROI557","LROI557"]
[{"$f":"HYPERLINK(\"#'\"&Helper_Benamingen!$A11&\"'!A1\", Helper_Benamingen!B11)","v":"Ziekenhuis waar operatie heeft plaatsgevonden"},"implantingProcedureHospital","Algemene informatie",1,"","","LROI010","LROI010","LROI099","LROI099","LROI199","LROI199","LROI276","LROI276","LROI366","LROI366","LROI460","LROI460","LROI558","LROI558"]
[{"$f":"HYPERLINK(\"#'\"&Helper_Benamingen!$A12&\"'!A1\", Helper_Benamingen!B12)","v":"Operatiezijde"},"procedureSide","Algemene informatie",1,"","","LROI011","LROI011","LROI100","LROI100","LROI200","LROI200","LROI277","LROI277","LROI367","LROI367","LROI461","LROI461","LROI559","LROI559"]
[{"$f":"HYPERLINK(\"#'\"&Helper_Benamingen!$A13&\"'!A1\", Helper_Benamingen!B13)","v":"Positie prothese"},"prosthesisPosition","Algemene informatie",1,"","","","","","","","","","","","","","","LROI560","LROI560"]
[{"$f":"HYPERLINK(\"#'\"&Helper_Benamingen!$A14&\"'!A1\", Helper_Benamingen!B14)","v":"Locatie prothese"},"prosthesisLocation","Algemene informatie",1,"","","","","","","","","","","","","","","LROI561","LROI561"]
[{"$f":"HYPERLINK(\"#'\"&Helper_Benamingen!$A15&\"'!A1\", Helper_Benamingen!B15)","v":"Postcode"},"patientPostalcode","Patiënt ",0,"","","LROI012","LROI012","LROI101","LROI101","LROI201","LROI201","LROI278","LROI278","LROI368","LROI368","LROI462","LROI462","LROI562","LROI562"]
[{"$f":"HYPERLINK(\"#'\"&Helper_Benamingen!$A16&\"'!A1\", Helper_Benamingen!B16)","v":"Buitenlandse postcode"},"foreignPostalCode","Patiënt",0,"","","LROI013","LROI013","LROI102","LROI102","LROI202","LROI202","LROI279","LROI279","LROI369","LROI369","LROI463","LROI463","LROI563","LROI563"]
[{"$f":"HYPERLINK(\"#'\"&Helper_Benamingen!$A17&\"'!A1\", Helper_Benamingen!B17)","v":"Lichaamslengte"},"patientLength","Patiënt",0,"","","LROI014","LROI014","LROI103","LROI103","LROI203","LROI203","LROI280","LROI280","LROI370","LROI370","LROI464","LROI464","LROI564","LROI564"]
[{"$f":"HYPERLINK(\"#'\"&Helper_Benamingen!$A18&\"'!A1\", Helper_Benamingen!B18)","v":"Lichaamsgewicht"},"patientWeight","Patiënt",0,"","","LROI015","LROI015","LROI104","LROI104","LROI204","LROI204","LROI281","LROI281","LROI371","LROI371","LROI465","LROI465","LROI565","LROI565"]
[{"$f":"HYPERLINK(\"#'\"&Helper_Benamingen!$A19&\"'!A1\", Helper_Benamingen!B19)","v":"Roken"},"patientSmoking","Patiënt",0,"","","LROI016","LROI016","LROI105","LROI105","LROI205","LROI205","LROI282","LROI282","LROI372","LROI372","LROI466","LROI466","LROI566","LROI566"]
[{"$f":"HYPERLINK(\"#'\"&Helper_Benamingen!$A20&\"'!A1\", Helper_Benamingen!B20)","v":"BMI"},"patientBmi","Patiënt",0,"","","LROI017","LROI017","LROI106","LROI106","LROI206","LROI206","LROI283","LROI283","LROI373","LROI373","LROI467","LROI467","LROI567","LROI567"]
["Voorkeurshand","handedness","Patiënt",0,"",null,null,"","","","","","LROI284","LROI284","LROI374","LROI374","LROI468","LROI468","LROI568","LROI568"]
[{"$f":"HYPERLINK(\"#'\"&Helper_Benamingen!$A21&\"'!A1\", Helper_Benamingen!B21)","v":"Diagnose"},"diagnosis","Diagnose ",0,"","","LROI018","","LROI107","","LROI207","","LROI285","","LROI375","","LROI469","","LROI59",""]
[{"$f":"HYPERLINK(\"#'\"&Helper_Benamingen!$A22&\"'!A1\", Helper_Benamingen!B22)","v":"Andere diagnose, specificeer"},"diagnosisOther","Diagnose ",0,"","","LROI019","","LROI108","","LROI208","","LROI286","","LROI376","","LROI470","","LROI570",""]
["Locatie artrose","locationOsteoarthritis","Diagnose ",0,{"$f":"IF(NOT(ISERROR(LEFT(E25, FIND(\" \",E25)-1))), LEFT(E25, FIND(\" \",E25)-1), E25)","v":""},null,null,null,"LROI109"]
[{"$f":"HYPERLINK(\"#'\"&Helper_Benamingen!$A23&\"'!A1\", Helper_Benamingen!B23)","v":"ASA classificatie"},"asaClassification","Diagnose / Reden voor revisie",0,"","","LROI020","LROI020","LROI110","LROI110","LROI209","LROI209","LROI287","LROI287","LROI377","LROI377","LROI471","LROI471","LROI571","LROI571"]
[{"$f":"HYPERLINK(\"#'\"&Helper_Benamingen!$A24&\"'!A1\", Helper_Benamingen!B24)","v":"Charnley classificatie"},"charnleyClassification","Diagnose / Reden voor revisie",0,"","","LROI021","LROI021","LROI111","LROI111","LROI210","LROI210","","","","","","","",""]
[{"$f":"HYPERLINK(\"#'\"&Helper_Benamingen!$A25&\"'!A1\", Helper_Benamingen!B25)","v":"Walch classificatie"},"walch","Diagnose",0,"","","","","","","","","LROI288","","","","","","",""]
[{"$f":"HYPERLINK(\"#'\"&Helper_Benamingen!$A26&\"'!A1\", Helper_Benamingen!B26)","v":"Infectie"},"infection","Reden voor revisie",0,"","","","LROI022","","LROI112","","LROI211","","LROI289","","LROI378","","LROI472","",""]
[{"$f":"HYPERLINK(\"#'\"&Helper_Benamingen!$A27&\"'!A1\", Helper_Benamingen!B27)","v":"Slijtage cup/lager"},"cupLinerWear","Reden voor revisie",0,"","","","LROI023","","","","","","","","","","","",""]
[{"$f":"HYPERLINK(\"#'\"&Helper_Benamingen!$A28&\"'!A1\", Helper_Benamingen!B28)","v":"Slijtage van insert"},"wearInlay","Reden voor revisie",0,"","","","","","LROI115","","","","","","","","","",""]
[{"$f":"HYPERLINK(\"#'\"&Helper_Benamingen!$A29&\"'!A1\", Helper_Benamingen!B29)","v":"Slijtage inlay"},"wearOfInlay","Reden voor revisie",0,"","","","","","","","LROI212","","","","","","","",""]
[{"$f":"HYPERLINK(\"#'\"&Helper_Benamingen!$A30&\"'!A1\", Helper_Benamingen!B30)","v":"Slijtage van polyethyleen"},"polyethyleneWear","Reden voor revisie",0,"","","","","","","","","","","","LROI379","","","",""]
[{"$f":"HYPERLINK(\"#'\"&Helper_Benamingen!$A31&\"'!A1\", Helper_Benamingen!B31)","v":"Periprothetische fractuur"},"periprostheticFracture","Reden voor revisie",0,"","","","LROI024","","LROI116","","LROI213","","LROI290","","LROI380","","LROI473","",""]
[{"$f":"HYPERLINK(\"#'\"&Helper_Benamingen!$A32&\"'!A1\", Helper_Benamingen!B32)","v":"Malpositie of malalignment"},"malalignment","Reden voor revisie",0,"","","","LROI025","","LROI117","",null,"","LROI291","","LROI381","","LROI476","","LROI572"]
[{"$f":"HYPERLINK(\"#'\"&Helper_Benamingen!$A33&\"'!A1\", Helper_Benamingen!B33)","v":"Malalignment"},"malalignment","Reden voor revisie",0,"","","",null,null,null,"","LROI214",""]
[{"$f":"HYPERLINK(\"#'\"&Helper_Benamingen!$A34&\"'!A1\", Helper_Benamingen!B34)","v":"Malpositie"},"malposition","Reden voor revisie",0,"","","","","","","","LROI215","","","","","","","",""]
[{"$f":"HYPERLINK(\"#'\"&Helper_Benamingen!$A35&\"'!A1\", Helper_Benamingen!B35)","v":"Luxatie"},"dislocation","Reden voor revisie",0,"","","","LROI026","","","","","","","","","","LROI475","","LROI574"]
[{"$f":"HYPERLINK(\"#'\"&Helper_Benamingen!$A36&\"'!A1\", Helper_Benamingen!B36)","v":"Luxatie patella"},"patellaDislocation","Reden voor revisie",0,"","","","","","LROI113","","","","","","","","","",""]
[{"$f":"HYPERLINK(\"#'\"&Helper_Benamingen!$A37&\"'!A1\", Helper_Benamingen!B37)","v":"Luxatie bearing"},"bearingDislocation","Reden voor revisie",0,"","","","","","LROI114","","","","","","","","","",""]
[{"$f":"HYPERLINK(\"#'\"&Helper_Benamingen!$A38&\"'!A1\", Helper_Benamingen!B38)","v":"Instabiliteit of dislocatie"},"instability","Reden voor revisie",0,"","","","","","LROI118","",null,"","LROI292","","LROI382","","LROI474","","LROI573"]
[{"$f":"HYPERLINK(\"#'\"&Helper_Benamingen!$A39&\"'!A1\", Helper_Benamingen!B39)","v":"Instabiliteit"},"instability","Reden voor revisie",0,"","","","","",null,"","LROI216"]
[{"$f":"HYPERLINK(\"#'\"&Helper_Benamingen!$A40&\"'!A1\", Helper_Benamingen!B40)","v":"Peri-articulaire ossificatie"},"periArticularOssification","Reden voor revisie",0,"","","","LROI027","","","","","","","","","","","",""]
[{"$f":"HYPERLINK(\"#'\"&Helper_Benamingen!$A41&\"'!A1\", Helper_Benamingen!B41)","v":"Artrofibrose"},"arthrofibrosis","Reden voor revisie",0,"","","","","","LROI119","","LROI219","","","","","","","",""]
[{"$f":"HYPERLINK(\"#'\"&Helper_Benamingen!$A42&\"'!A1\", Helper_Benamingen!B42)","v":"Cuff artropathie"},"cuffArthropathy","Reden voor revisie",0,"","","","","","","","","","LROI293","","","","","",""]
[{"$f":"HYPERLINK(\"#'\"&Helper_Benamingen!$A43&\"'!A1\", Helper_Benamingen!B43)","v":"Onherstelbare cuff ruptuur"},"cuffRupture","Reden voor revisie",0,"","","","","","","","","","LROI294","","","","","",""]
[{"$f":"HYPERLINK(\"#'\"&Helper_Benamingen!$A44&\"'!A1\", Helper_Benamingen!B44)","v":"Metallose"},"metallosis","Reden voor revisie",0,"","","","","","","","","","","","LROI383","","","",""]
[{"$f":"HYPERLINK(\"#'\"&Helper_Benamingen!$A45&\"'!A1\", Helper_Benamingen!B45)","v":"Implantaatbreuk"},"implantBreakage","Reden voor revisie",0,"","","","","","","","","","","","","","LROI477","","LROI575"]
[{"$f":"HYPERLINK(\"#'\"&Helper_Benamingen!$A46&\"'!A1\", Helper_Benamingen!B46)","v":"Loslating acetabulumcomponent"},"looseningAcetabularComponent","Reden voor revisie",0,"","","","LROI028","","","","","","","","","","","",""]
[{"$f":"HYPERLINK(\"#'\"&Helper_Benamingen!$A47&\"'!A1\", Helper_Benamingen!B47)","v":"Loslating femurcomponent"},"looseningFemoralComponent","Reden voor revisie",0,"","","","LROI029","","LROI120","","","","","","","","","",""]
[{"$f":"HYPERLINK(\"#'\"&Helper_Benamingen!$A48&\"'!A1\", Helper_Benamingen!B48)","v":"Loslating tibiacomponent"},"looseningTibialComponent","Reden voor revisie",0,"","","","","","LROI121","","LROI217","","","","","","","",""]
[{"$f":"HYPERLINK(\"#'\"&Helper_Benamingen!$A49&\"'!A1\", Helper_Benamingen!B49)","v":"Loslating patellacomponent"},"looseningPatellarComponent","Reden voor revisie",0,"","","","","","LROI122","","","","","","","","","",""]
[{"$f":"HYPERLINK(\"#'\"&Helper_Benamingen!$A50&\"'!A1\", Helper_Benamingen!B50)","v":"Loslating taluscomponent"},"looseningTalusComponent","Reden voor revisie",0,"","","","","","","","LROI218","","","","","","","",""]
[{"$f":"HYPERLINK(\"#'\"&Helper_Benamingen!$A51&\"'!A1\", Helper_Benamingen!B51)","v":"Loslating humeruscomponent"},"looseningHumeralComponent","Reden voor revisie",0,"","","","","","","","","","LROI295","","LROI384","","","",""]
[{"$f":"HYPERLINK(\"#'\"&Helper_Benamingen!$A52&\"'!A1\", Helper_Benamingen!B52)","v":"Loslating glenoïdcomponent"},"looseningGlenoidComponent","Reden voor revisie",0,"","","","","","","","","","LROI296","","","","","",""]
[{"$f":"HYPERLINK(\"#'\"&Helper_Benamingen!$A53&\"'!A1\", Helper_Benamingen!B53)","v":"Loslating ulnacomponent"},"looseningUlnarComponent","Reden voor revisie",0,"","","","","","","","","","","","LROI385","","LROI479","",""]
[{"$f":"HYPERLINK(\"#'\"&Helper_Benamingen!$A54&\"'!A1\", Helper_Benamingen!B54)","v":"Loslating radiuscomponent"},"looseningRadialComponent","Reden voor revisie",0,"","","","","","","","","","","","","","LROI478","",""]
[{"$f":"HYPERLINK(\"#'\"&Helper_Benamingen!$A55&\"'!A1\", Helper_Benamingen!B55)","v":"Loslating carpaalcomponent"},"looseningCarpalComponent ","Reden voor revisie",0,"","","","","","","","","","","","","","LROI480","",""]
[{"$f":"HYPERLINK(\"#'\"&Helper_Benamingen!$A56&\"'!A1\", Helper_Benamingen!B56)","v":"Loslating proximale component"},"looseningProximalComponent","Reden voor revisie",0,"","","","","","","","","","","","","","","","LROI576"]
[{"$f":"HYPERLINK(\"#'\"&Helper_Benamingen!$A57&\"'!A1\", Helper_Benamingen!B57)","v":"Loslating distale component"},"looseningDistalComponent","Reden voor revisie",0,"","","","","","","","","","","","","","","","LROI577"]
[{"$f":"HYPERLINK(\"#'\"&Helper_Benamingen!$A58&\"'!A1\", Helper_Benamingen!B58)","v":"Symptomatische MoM articulatie"},"symptomaticMomBearing","Reden voor revisie",0,"","","","LROI030","","","","","","","","","","","",""]
[{"$f":"HYPERLINK(\"#'\"&Helper_Benamingen!$A59&\"'!A1\", Helper_Benamingen!B59)","v":"Progressie van artrose (partiële knieprothese)"},"progressionOsteoarthritis","Reden voor revisie",0,"","","","","","LROI123","","","","","","","","","",""]
[{"$f":"HYPERLINK(\"#'\"&Helper_Benamingen!$A60&\"'!A1\", Helper_Benamingen!B60)","v":"Progressie van glenoïd artrose"},"progressionGlenoidOsteoarthritis","Reden voor revisie",0,"","","","","","","","","","LROI297","","","","","",""]
[{"$f":"HYPERLINK(\"#'\"&Helper_Benamingen!$A61&\"'!A1\", Helper_Benamingen!B61)","v":"Pijn"},"pain","Reden voor revisie",0,"","","","","","LROI125","","","","","","","","","",""]
[{"$f":"HYPERLINK(\"#'\"&Helper_Benamingen!$A62&\"'!A1\", Helper_Benamingen!B62)","v":"Cystevorming"},"cysteFormation","Reden voor revisie",0,"","","","","","","","LROI220","","","","","","","",""]
[{"$f":"HYPERLINK(\"#'\"&Helper_Benamingen!$A63&\"'!A1\", Helper_Benamingen!B63)","v":"Mechanische complicatie radiuskopprothese"},"mechComplRadialHead","Reden voor revisie",0,"","","","","","","","","","","","LROI386","","","",""]
[{"$f":"HYPERLINK(\"#'\"&Helper_Benamingen!$A64&\"'!A1\", Helper_Benamingen!B64)","v":"Botresorptie rondom radiuscomponent"},"boneResorptionRadialComp","Reden voor revisie",0,"","","","","","","","","","","","","","LROI481","",""]
[{"$f":"HYPERLINK(\"#'\"&Helper_Benamingen!$A65&\"'!A1\", Helper_Benamingen!B65)","v":"Botresorptie rondom ulnacomponent"},"boneResorptionUlnarComp","Reden voor revisie",0,"","","","","","","","","","","","","","LROI482","",""]
[{"$f":"HYPERLINK(\"#'\"&Helper_Benamingen!$A66&\"'!A1\", Helper_Benamingen!B66)","v":"Botresorptie rondom carpaalcomponent"},"boneResorptionCarpalComp","Reden voor revisie",0,"","","","","","","","","","","","","","LROI483","",""]
[{"$f":"HYPERLINK(\"#'\"&Helper_Benamingen!$A67&\"'!A1\", Helper_Benamingen!B67)","v":"Botresorptie rondom proximale component"},"boneResorptionProximal","Reden voor revisie",0,"","","","","","","","","","","","","","","","LROI578"]
[{"$f":"HYPERLINK(\"#'\"&Helper_Benamingen!$A68&\"'!A1\", Helper_Benamingen!B68)","v":"Botresorptie rondom distale component"},"boneResorptionDistal","Reden voor revisie",0,"","","","","","","","","","","","","","","","LROI579"]
[{"$f":"HYPERLINK(\"#'\"&Helper_Benamingen!$A69&\"'!A1\", Helper_Benamingen!B69)","v":"Status na heupprothese-verwijdering (Girdlestone)"},"revisionAfterHipRemoval","Reden voor revisie",0,"","","","LROI031","","","","","","","","","","","",""]
[{"$f":"HYPERLINK(\"#'\"&Helper_Benamingen!$A70&\"'!A1\", Helper_Benamingen!B70)","v":"Status na knieprotheseverwijdering"},"revisionAfterKneeRemoval","Reden voor revisie",0,"","","","","","LROI124","","","","","","","","","",""]
[{"$f":"HYPERLINK(\"#'\"&Helper_Benamingen!$A71&\"'!A1\", Helper_Benamingen!B71)","v":"Status na enkelprotheseverwijdering"},"revisionAfterAnkleRemoval","Reden voor revisie",0,"","","","","","","","LROI221","","","","","","","",""]
[{"$f":"HYPERLINK(\"#'\"&Helper_Benamingen!$A72&\"'!A1\", Helper_Benamingen!B72)","v":"Status na schouderprotheseverwijdering"},"revisionAfterShoulderRemoval","Reden voor revisie",0,"","","","","","","","","","LROI298","","","","","",""]
[{"$f":"HYPERLINK(\"#'\"&Helper_Benamingen!$A73&\"'!A1\", Helper_Benamingen!B73)","v":"Status na elleboogprotheseverwijdering"},"revisionAfterElbowRemoval","Reden voor revisie",0,"","","","","","","","","","","","LROI387","","","",""]
[{"$f":"HYPERLINK(\"#'\"&Helper_Benamingen!$A74&\"'!A1\", Helper_Benamingen!B74)","v":"Status na polsprotheseverwijdering"},"revisionAfterWristRemoval","Reden voor revisie",0,"","","","","","","","","","","","","","LROI484","",""]
[{"$f":"HYPERLINK(\"#'\"&Helper_Benamingen!$A75&\"'!A1\", Helper_Benamingen!B75)","v":"Status na vingerprotheseverwijdering"},"revisionAfterFingerRemoval","Reden voor revisie",0,"","","","","","","","","","","","","","","","LROI580"]
[{"$f":"HYPERLINK(\"#'\"&Helper_Benamingen!$A76&\"'!A1\", Helper_Benamingen!B76)","v":"Andere reden voor revisie"},"otherReasonForRevision","Reden voor revisie",0,"","","","LROI032","","LROI126","","LROI222","","LROI299","","LROI388","","LROI485","","LROI581"]
[{"$f":"HYPERLINK(\"#'\"&Helper_Benamingen!$A77&\"'!A1\", Helper_Benamingen!B77)","v":"Andere reden voor revisie, specificeer"},"reasonRevisionOther","Reden voor revisie",0,"","","","LROI033","","LROI127","","LROI223","","LROI300","","LROI389","","LROI486","","LROI582"]
[{"$f":"HYPERLINK(\"#'\"&Helper_Benamingen!$A78&\"'!A1\", Helper_Benamingen!B78)","v":"Specialisme"},"specialism","Type operatie",0,"","","LROI043","LROI043","","","","","LROI301","LROI301","LROI394","LROI394","LROI497","LROI497","LROI588","LROI588"]
[{"$f":"HYPERLINK(\"#'\"&Helper_Benamingen!$A79&\"'!A1\", Helper_Benamingen!B79)","v":"BIG hoofdoperateur"},"surgeonCode","Type operatie",0,"","","LROI044","LROI044","LROI143","LROI143","LROI232","LROI232","LROI302","LROI302","LROI395","LROI395","LROI498","LROI498","LROI589","LROI589"]
[{"$f":"HYPERLINK(\"#'\"&Helper_Benamingen!$A80&\"'!A1\", Helper_Benamingen!B80)","v":"BIG assisterend chirurg"},"assistantSurgeonCode","Type operatie",0,"","","LROI045","LROI045","LROI144","LROI144","LROI233","LROI233","LROI303","LROI303","LROI396","LROI396","LROI499","LROI499","LROI590","LROI590"]
[{"$f":"HYPERLINK(\"#'\"&Helper_Benamingen!$A81&\"'!A1\", Helper_Benamingen!B81)","v":"Type prothese"},"prosthesisType","Type operatie",0,"","","LROI034","","LROI128","","LROI224","","LROI304","","LROI390","","LROI487","","",""]
[{"$f":"HYPERLINK(\"#'\"&Helper_Benamingen!$A82&\"'!A1\", Helper_Benamingen!B82)","v":"Ander type prothese, specificeer"},"prosthesisOther","Type operatie",0,"","","LROI035","","LROI129","","LROI225","","LROI305","","LROI391","","LROI488","","",""]
[{"$f":"HYPERLINK(\"#'\"&Helper_Benamingen!$A83&\"'!A1\", Helper_Benamingen!B83)","v":"Indien unicondylair, zijde prothese"},"unicondylar","Type operatie",0,"","","","","LROI130","","","","","","","","","","",""]
[{"$f":"HYPERLINK(\"#'\"&Helper_Benamingen!$A84&\"'!A1\", Helper_Benamingen!B84)","v":"Plaatsing patellacomponent"},"patellaComponent","Type operatie",0,"","","","","LROI131","","","","","","","","","","",""]
[{"$f":"HYPERLINK(\"#'\"&Helper_Benamingen!$A85&\"'!A1\", Helper_Benamingen!B85)","v":"Radiuskopcomponent geplaatst"},"radialHeadComp","Type operatie",0,"","","","","","","","","","","LROI392","","","","",""]
[{"$f":"HYPERLINK(\"#'\"&Helper_Benamingen!$A86&\"'!A1\", Helper_Benamingen!B86)","v":"Prothese gelinkt"},"prosthesisLinked","Type operatie",0,"","","","","","","","","","","LROI393","","","","",""]
["Gereviseerde prothese","revisedProsthesis","Type operatie",0,"",null,"","","","","","",null,"LROI306","","","","","",""]
["Type humerale component van gereviseerde prothese","humeralComponent","Type operatie",0,"",null,"","","","","","",null,"LROI307","","","","","",""]
[{"$f":"HYPERLINK(\"#'\"&Helper_Benamingen!$A89&\"'!A1\", Helper_Benamingen!B89)","v":"Type revisie"},"revisionType","Type operatie",0,"","","","LROI036","","LROI132","","LROI226","","LROI308","","LROI397","","LROI489","","LROI583"]
[{"$f":"HYPERLINK(\"#'\"&Helper_Benamingen!$A90&\"'!A1\", Helper_Benamingen!B90)","v":"Ander type revisie, specificeer"},"revisionOther","Type operatie",0,"","","","LROI037","","LROI133","","LROI227","","LROI309","","LROI398","","LROI490","","LROI584"]
[{"$f":"HYPERLINK(\"#'\"&Helper_Benamingen!$A91&\"'!A1\", Helper_Benamingen!B91)","v":"Conversie naar totale heupprothese"},"conversionToTotalHip","Type operatie",0,"","","","LROI038","","","","","","","","","","","",""]
[{"$f":"HYPERLINK(\"#'\"&Helper_Benamingen!$A92&\"'!A1\", Helper_Benamingen!B92)","v":"Amputatie"},"amputation","Type operatie",0,"","","","","","LROI134","","LROI228","","LROI310","","LROI399","","LROI492","","LROI585"]
[{"$f":"HYPERLINK(\"#'\"&Helper_Benamingen!$A93&\"'!A1\", Helper_Benamingen!B93)","v":"Conversie naar totale knieprothese"},"conversionTotalKnee","Type operatie",0,"","","","","","LROI135","","","","","","","","","",""]
[{"$f":"HYPERLINK(\"#'\"&Helper_Benamingen!$A94&\"'!A1\", Helper_Benamingen!B94)","v":"Conversie van hemi naar totale schouderprothese"},"conversionHemiToTotal","Type operatie",0,"","","","","","","","","","LROI311","","","","","",""]
[{"$f":"HYPERLINK(\"#'\"&Helper_Benamingen!$A95&\"'!A1\", Helper_Benamingen!B95)","v":"Conversie van totale naar hemischouderprothese"},"conversionTotalToHemi","Type operatie",0,"","","","","","","","","","LROI312","","","","","",""]
[{"$f":"HYPERLINK(\"#'\"&Helper_Benamingen!$A96&\"'!A1\", Helper_Benamingen!B96)","v":"Conversie naar totale elleboogprothese"},"conversionToTotalElbow","Type operatie",0,"","","","","","","","","","","","LROI400","","","",""]
[{"$f":"HYPERLINK(\"#'\"&Helper_Benamingen!$A97&\"'!A1\", Helper_Benamingen!B97)","v":"Patellacomponent (bij)geplaatst"},"patellaComponent","Type operatie",0,"","","","","LROI136","","","","","","","","","","",""]
[{"$f":"HYPERLINK(\"#'\"&Helper_Benamingen!$A98&\"'!A1\", Helper_Benamingen!B98)","v":"Unicompartimentele prothese  bijgeplaatst"},"uniProsthesisAdded","Type operatie",0,"","","","","","LROI137","","","","","","","","","",""]
[{"$f":"HYPERLINK(\"#'\"&Helper_Benamingen!$A99&\"'!A1\", Helper_Benamingen!B99)","v":"VKB functioneel intact"},"anteriorCrucLig","Type operatie",0,"","","","","","LROI138","","","","","","","","","",""]
[{"$f":"HYPERLINK(\"#'\"&Helper_Benamingen!$A100&\"'!A1\", Helper_Benamingen!B100)","v":"Radiuskopresectie"},"radialHeadResection","Type operatie",0,"","","","","","","","","","","","LROI401","","","",""]
[{"$f":"HYPERLINK(\"#'\"&Helper_Benamingen!$A101&\"'!A1\", Helper_Benamingen!B101)","v":"Linking ulnar cap"},"ulnarCap","Type operatie",0,"","","","","","","","","","","","LROI402","","","",""]
[{"$f":"HYPERLINK(\"#'\"&Helper_Benamingen!$A102&\"'!A1\", Helper_Benamingen!B102)","v":"Acetabulumcomponent gereviseerd"},"acetabulumRevised","Type operatie",0,"","","","LROI039","","","","","","","","","","","",""]
[{"$f":"HYPERLINK(\"#'\"&Helper_Benamingen!$A103&\"'!A1\", Helper_Benamingen!B103)","v":"Inlay/lager gereviseerd"},"inlayRevised","Type operatie",0,"","","","LROI040","",null,null,null,null,null,null,null,null,null,"",""]
[{"$f":"HYPERLINK(\"#'\"&Helper_Benamingen!$A104&\"'!A1\", Helper_Benamingen!B104)","v":"Femurkopcomponent gereviseerd"},"headRevised","Type operatie",0,"","","","LROI041","","","","","","","","","","","",""]
[{"$f":"HYPERLINK(\"#'\"&Helper_Benamingen!$A105&\"'!A1\", Helper_Benamingen!B105)","v":"Femurcomponent gereviseerd"},"femurRevised","Type operatie",0,"","","","LROI042","","LROI139","","","","","","","","","",""]
[{"$f":"HYPERLINK(\"#'\"&Helper_Benamingen!$A106&\"'!A1\", Helper_Benamingen!B106)","v":"Tibiacomponent gereviseerd"},"tibiaRevised","Type operatie",0,"","","","","","LROI140","","LROI229","","","","","","","",""]
[{"$f":"HYPERLINK(\"#'\"&Helper_Benamingen!$A107&\"'!A1\", Helper_Benamingen!B107)","v":"Inlay gereviseerd"},"inlayRevised","Type operatie",0,"","","",null,"","LROI141","","LROI231","","","","","","LROI495","",""]
[{"$f":"HYPERLINK(\"#'\"&Helper_Benamingen!$A108&\"'!A1\", Helper_Benamingen!B108)","v":"Patellacomponent gereviseerd"},"patellaRevised","Type operatie",0,"","","","","","LROI142","","","","","","","","","",""]
[{"$f":"HYPERLINK(\"#'\"&Helper_Benamingen!$A109&\"'!A1\", Helper_Benamingen!B109)","v":"Taluscomponent gereviseerd"},"talusRevised","Type operatie",0,"","","","","","","","LROI230","","","","","","","",""]
[{"$f":"HYPERLINK(\"#'\"&Helper_Benamingen!$A110&\"'!A1\", Helper_Benamingen!B110)","v":"Humeruscomponent gereviseerd"},"humerusRevised","Type operatie",0,"","","","","","","","","","LROI313","","LROI403","","","",""]
[{"$f":"HYPERLINK(\"#'\"&Helper_Benamingen!$A111&\"'!A1\", Helper_Benamingen!B111)","v":"Humeruskop/humerale liner gereviseerd"},"humeralHeadRevised","Type operatie",0,"","","","","","","","","","LROI314","","","","","",""]
[{"$f":"HYPERLINK(\"#'\"&Helper_Benamingen!$A112&\"'!A1\", Helper_Benamingen!B112)","v":"Glenoïdcup/glenosfeer gereviseerd"},"glenoidCupGlenosphereRevised","Type operatie",0,"","","","","","","","","","LROI315","","","","","",""]
[{"$f":"HYPERLINK(\"#'\"&Helper_Benamingen!$A113&\"'!A1\", Helper_Benamingen!B113)","v":"Metafyse/taper gereviseerd"},"metaphysisTaperRevised","Type operatie",0,"","","","","","","","","","LROI316","","","","","",""]
[{"$f":"HYPERLINK(\"#'\"&Helper_Benamingen!$A114&\"'!A1\", Helper_Benamingen!B114)","v":"Glenoïd liner/baseplate gereviseerd"},"glenoidLinerBaseplateRevised","Type operatie",0,"","","","","","","","","","LROI317","","","","","",""]
[{"$f":"HYPERLINK(\"#'\"&Helper_Benamingen!$A115&\"'!A1\", Helper_Benamingen!B115)","v":"Ulnacomponent gereviseerd"},"ulnaRevised","Type operatie",0,"","","","","","","","","","","","LROI404","","LROI494","",""]
[{"$f":"HYPERLINK(\"#'\"&Helper_Benamingen!$A116&\"'!A1\", Helper_Benamingen!B116)","v":"Radiuscomponent gereviseerd"},"radiusRevised","Type operatie",0,"","","","","","","","","","","","LROI405","","LROI493","",""]
[{"$f":"HYPERLINK(\"#'\"&Helper_Benamingen!$A117&\"'!A1\", Helper_Benamingen!B117)","v":"Ulnacomponent gereviseerd"},"ulnaRevised","Type operatie",0,"","","","","","","","","","","","LROI404","","LROI494","",""]
[{"$f":"HYPERLINK(\"#'\"&Helper_Benamingen!$A118&\"'!A1\", Helper_Benamingen!B118)","v":"Carpaalcomponent gereviseerd"},"carpalRevised ","Type operatie",0,"","","","","","","","","","","","","","LROI496","",""]
[{"$f":"HYPERLINK(\"#'\"&Helper_Benamingen!$A119&\"'!A1\", Helper_Benamingen!B119)","v":"Proximale component gereviseerd"},"proximalComponentRevised","Type operatie",0,"","","","","","","","","","","","","","","","LROI586"]
[{"$f":"HYPERLINK(\"#'\"&Helper_Benamingen!$A120&\"'!A1\", Helper_Benamingen!B120)","v":"Distale component gereviseerd"},"distalComponentRevised","Type operatie",0,"","","","","","","","","","","","","","","","LROI587"]
[{"$f":"HYPERLINK(\"#'\"&Helper_Benamingen!$A121&\"'!A1\", Helper_Benamingen!B121)","v":"Benadering"},"approach","Operatiekenmerken",0,"","","LROI046","","LROI145","","LROI234","","LROI318","","LROI406","LROI406","LROI500","","LROI591",""]
[{"$f":"HYPERLINK(\"#'\"&Helper_Benamingen!$A122&\"'!A1\", Helper_Benamingen!B122)","v":"Andere benadering, specificeer"},"approachOther","Operatiekenmerken ",0,"","","LROI047","","LROI146","","LROI235","","LROI319","","LROI407","LROI407","LROI501","","LROI592",""]
[{"$f":"HYPERLINK(\"#'\"&Helper_Benamingen!$A123&\"'!A1\", Helper_Benamingen!B123)","v":"(Correctie) osteotomie uitgevoerd"},"osteotomyPerformed","Operatiekenmerken ",0,"","","LROI048","","","","","","","","","","","","",""]
[{"$f":"HYPERLINK(\"#'\"&Helper_Benamingen!$A124&\"'!A1\", Helper_Benamingen!B124)","v":"Osteosynthese uitgevoerd"},"osteosynthesisPerformed","Operatiekenmerken ",0,"","","LROI049","","","","","","","","","","","","",""]
[{"$f":"HYPERLINK(\"#'\"&Helper_Benamingen!$A125&\"'!A1\", Helper_Benamingen!B125)","v":"Tuberositas osteotomie uitgevoerd"},"tuberositasOsteotomy","Operatiekenmerken ",0,"","","","","LROI147","","","",null,"","","","","","",""]
[{"$f":"HYPERLINK(\"#'\"&Helper_Benamingen!$A126&\"'!A1\", Helper_Benamingen!B126)","v":"Mediale malleolus osteotomie uitgevoerd"},"medialMalleolarOsteotomy","Operatiekenmerken ",0,"","","","","","","LROI236","","","","","","","","",""]
[{"$f":"HYPERLINK(\"#'\"&Helper_Benamingen!$A127&\"'!A1\", Helper_Benamingen!B127)","v":"Achillespeesverlenging uitgevoerd"},"achillesTendonLengthening","Operatiekenmerken ",0,"","","","","","","LROI237","","","","","","","","",""]
[{"$f":"HYPERLINK(\"#'\"&Helper_Benamingen!$A128&\"'!A1\", Helper_Benamingen!B128)","v":"Ligament reconstructie uitgevoerd"},"ligamentReconstruction","Operatiekenmerken ",0,"","","","","","","LROI238","","","","","","","","LROI598",""]
[{"$f":"HYPERLINK(\"#'\"&Helper_Benamingen!$A129&\"'!A1\", Helper_Benamingen!B129)","v":"Osteotomie van het tuberculum minus uitgevoerd"},"tuberositasOsteotomy","Operatiekenmerken ",0,"","","","",null,"","","","LROI320","","","","","","",""]
[{"$f":"HYPERLINK(\"#'\"&Helper_Benamingen!$A130&\"'!A1\", Helper_Benamingen!B130)","v":"Acromioplastiek uitgevoerd"},"acromioplasty","Operatiekenmerken ",0,"","","","","","","","","LROI321","","","","","","",""]
[{"$f":"HYPERLINK(\"#'\"&Helper_Benamingen!$A131&\"'!A1\", Helper_Benamingen!B131)","v":"Cuff reconstructie uitgevoerd"},"cuffReconstruction","Operatiekenmerken ",0,"","","","","","","","","LROI322","","","","","","",""]
[{"$f":"HYPERLINK(\"#'\"&Helper_Benamingen!$A132&\"'!A1\", Helper_Benamingen!B132)","v":"Distale clavicula resectie uitgevoerd"},"distalClavicleResection","Operatiekenmerken ",0,"","","","","","","","","LROI323","","","","","","",""]
[{"$f":"HYPERLINK(\"#'\"&Helper_Benamingen!$A133&\"'!A1\", Helper_Benamingen!B133)","v":"LCL losgemaakt"},"lclReleased","Operatiekenmerken ",0,"","","","","","","","","","","LROI408","LROI408","","","",""]
[{"$f":"HYPERLINK(\"#'\"&Helper_Benamingen!$A134&\"'!A1\", Helper_Benamingen!B134)","v":"Decompressie ulnaire zenuw"},"ulnarNerveRelease","Operatiekenmerken ",0,"","","","","","","","","","","LROI409","LROI409","","","",""]
[{"$f":"HYPERLINK(\"#'\"&Helper_Benamingen!$A135&\"'!A1\", Helper_Benamingen!B135)","v":"Transpositie ulnaire zenuw"},"ulnarNerveTransposition","Operatiekenmerken ",0,"","","","","","","","","","","LROI410","LROI410","","","",""]
[{"$f":"HYPERLINK(\"#'\"&Helper_Benamingen!$A136&\"'!A1\", Helper_Benamingen!B136)","v":"Weke delen stabilisatie"},"softTissuesStabilisation","Operatiekenmerken ",0,"","","","","","","","","","","","","LROI502","","LROI593",""]
[{"$f":"HYPERLINK(\"#'\"&Helper_Benamingen!$A137&\"'!A1\", Helper_Benamingen!B137)","v":"Andere weke delen stabilisatie, specificeer"},"softTissuesStabilisationOther","Operatiekenmerken ",0,"","","","","","","","","","","","","LROI503","","LROI594",""]
[{"$f":"HYPERLINK(\"#'\"&Helper_Benamingen!$A138&\"'!A1\", Helper_Benamingen!B138)","v":"Darrach procedure uitgevoerd"},"darrachProcedure","Operatiekenmerken ",0,"","","","","","","","","","","","","LROI504","","",""]
[{"$f":"HYPERLINK(\"#'\"&Helper_Benamingen!$A139&\"'!A1\", Helper_Benamingen!B139)","v":"Ulna osteotomie uitgevoerd"},"ulnaOsteotomy","Operatiekenmerken ",0,"","","","","","","","","","","","","LROI505","","",""]
[{"$f":"HYPERLINK(\"#'\"&Helper_Benamingen!$A140&\"'!A1\", Helper_Benamingen!B140)","v":"Proximale rij resectie uitgevoerd"},"proximalRowResection","Operatiekenmerken ",0,"","","","","","","","","","","","","LROI506","","",""]
[{"$f":"HYPERLINK(\"#'\"&Helper_Benamingen!$A141&\"'!A1\", Helper_Benamingen!B141)","v":"Andere botprocedure, specificeer"},"additionalBoneProceduresOther","Operatiekenmerken ",0,"","","","","","","","","","","","","LROI507","","",""]
[{"$f":"HYPERLINK(\"#'\"&Helper_Benamingen!$A142&\"'!A1\", Helper_Benamingen!B142)","v":"Patient Specific Instrumentation (PSI) gebruikt"},"psi","Operatiekenmerken ",0,"","","LROI050","LROI050","LROI151","LROI151","LROI240","LROI240","LROI324","LROI324","LROI411","LROI411","","","",""]
[{"$f":"HYPERLINK(\"#'\"&Helper_Benamingen!$A143&\"'!A1\", Helper_Benamingen!B143)","v":"Navigatie gebruikt"},"navigation","Operatiekenmerken ",0,"","","LROI051","LROI051","LROI152","LROI152","LROI241","LROI241","LROI325","LROI325","LROI412","LROI412","","","",""]
[{"$f":"HYPERLINK(\"#'\"&Helper_Benamingen!$A144&\"'!A1\", Helper_Benamingen!B144)","v":"Doorlichting gebruikt"},"screening","Operatiekenmerken ",0,"","","LROI052","LROI052","","","","","","","","","","","",""]
[{"$f":"HYPERLINK(\"#'\"&Helper_Benamingen!$A145&\"'!A1\", Helper_Benamingen!B145)","v":"Robotassistentie gebruikt"},"robotAssistance","Operatiekenmerken ",0,"","","LROI053","LROI053","LROI153","LROI153","LROI242","LROI242","LROI326","LROI326","LROI413","LROI413","","","",""]
[{"$f":"HYPERLINK(\"#'\"&Helper_Benamingen!$A146&\"'!A1\", Helper_Benamingen!B146)","v":"Botgraft gebruikt"},"bonegraft","Operatiekenmerken ",0,"","","LROI054","LROI054","LROI154","LROI154","LROI243","LROI243","LROI327","LROI327","LROI414","LROI414","LROI509","LROI509","LROI596","LROI596"]
[{"$f":"HYPERLINK(\"#'\"&Helper_Benamingen!$A147&\"'!A1\", Helper_Benamingen!B147)","v":"Patellectomie uitgevoerd"},"patellectomy","Operatiekenmerken ",0,"","","","","","LROI148","","","","","","","","","",""]
[{"$f":"HYPERLINK(\"#'\"&Helper_Benamingen!$A148&\"'!A1\", Helper_Benamingen!B148)","v":"Artrodese uitgevoerd"},"arthrodesisPerformed","Operatiekenmerken ",0,"","","","","","LROI149","","LROI239","","","","","","LROI508","","LROI595"]
[{"$f":"HYPERLINK(\"#'\"&Helper_Benamingen!$A149&\"'!A1\", Helper_Benamingen!B149)","v":"Onder bloedleegte uitgevoerd"},"surgicalTourniquet","Operatiekenmerken ",0,"","","","","LROI150","LROI150","","","","","","","","","",""]
[{"$f":"HYPERLINK(\"#'\"&Helper_Benamingen!$A150&\"'!A1\", Helper_Benamingen!B150)","v":"Voorgaande operaties"},"previousOperations","Voorgaande operaties ",0,"","","LROI055","","LROI155","","LROI244","","LROI328","","LROI415","","LROI510","","LROI597",""]
[{"$f":"HYPERLINK(\"#'\"&Helper_Benamingen!$A151&\"'!A1\", Helper_Benamingen!B151)","v":"Osteosynthese"},"osteosynthesis","Voorgaande operaties ",0,"","","LROI056","","LROI159","","LROI245","","LROI329","","LROI416","","","","",""]
[{"$f":"HYPERLINK(\"#'\"&Helper_Benamingen!$A152&\"'!A1\", Helper_Benamingen!B152)","v":"Osteotomie"},"osteotomy","Voorgaande operaties ",0,"","","LROI057","","LROI157","","LROI246","","","","","","","","",""]
[{"$f":"HYPERLINK(\"#'\"&Helper_Benamingen!$A153&\"'!A1\", Helper_Benamingen!B153)","v":"Artrodese"},"arthrodesis","Voorgaande operaties ",0,"","","LROI058","","","","LROI253","","","","","","","","LROI599",""]
[{"$f":"HYPERLINK(\"#'\"&Helper_Benamingen!$A154&\"'!A1\", Helper_Benamingen!B154)","v":"Girdlestone"},"girdlestone","Voorgaande operaties ",0,"","","LROI059","","","","","","","","","","","","",""]
[{"$f":"HYPERLINK(\"#'\"&Helper_Benamingen!$A155&\"'!A1\", Helper_Benamingen!B155)","v":"Artroscopie"},"arthroscopy","Voorgaande operaties ",0,"","","LROI060","","LROI161","","LROI248","","","","LROI420","","","","",""]
[{"$f":"HYPERLINK(\"#'\"&Helper_Benamingen!$A156&\"'!A1\", Helper_Benamingen!B156)","v":"Open meniscectomie"},"meniscectomy","Voorgaande operaties ",0,"","","","","LROI156","","","","","","","","","","",""]
[{"$f":"HYPERLINK(\"#'\"&Helper_Benamingen!$A157&\"'!A1\", Helper_Benamingen!B157)","v":"Voorste kruisband reconstructie"},"aclReconstruction","Voorgaande operaties ",0,"","","","","LROI158","","","","","","","","","","",""]
[{"$f":"HYPERLINK(\"#'\"&Helper_Benamingen!$A158&\"'!A1\", Helper_Benamingen!B158)","v":"Synovectomie"},"synovectomy","Voorgaande operaties ",0,"","","","","LROI160","","LROI247","","","","","","","","",""]
[{"$f":"HYPERLINK(\"#'\"&Helper_Benamingen!$A159&\"'!A1\", Helper_Benamingen!B159)","v":"Patella realignment procedure"},"patellaRealignment","Voorgaande operaties ",0,"","","","","LROI162","","","","","","","","","","",""]
[{"$f":"HYPERLINK(\"#'\"&Helper_Benamingen!$A160&\"'!A1\", Helper_Benamingen!B160)","v":"Knie distractie"},"kneeDistraction","Voorgaande operaties ",0,"","","","","LROI163","","","","","","","","","","",""]
[{"$f":"HYPERLINK(\"#'\"&Helper_Benamingen!$A161&\"'!A1\", Helper_Benamingen!B161)","v":"Behandeling osteochondraal botdefect"},"ocdTreatment","Voorgaande operaties ",0,"","","","","","","LROI249","","","","","","","","",""]
[{"$f":"HYPERLINK(\"#'\"&Helper_Benamingen!$A162&\"'!A1\", Helper_Benamingen!B162)","v":"Ligament reconstructie"},"previousOperationsLigamentReconstruction","Voorgaande operaties ",0,"","","","","","","LROI250","","","","","","","","",""]
[{"$f":"HYPERLINK(\"#'\"&Helper_Benamingen!$A163&\"'!A1\", Helper_Benamingen!B163)","v":"Achtervoetchirurgie"},"hindfootSurgery","Voorgaande operaties ",0,"","","","","","","LROI251","","","","","","","","",""]
[{"$f":"HYPERLINK(\"#'\"&Helper_Benamingen!$A164&\"'!A1\", Helper_Benamingen!B164)","v":"Voorvoetchirurgie"},"forefootSurgery","Voorgaande operaties ",0,"","","","","","","LROI252","","","","","","","","",""]
[{"$f":"HYPERLINK(\"#'\"&Helper_Benamingen!$A165&\"'!A1\", Helper_Benamingen!B165)","v":"Acromioplastiek"},"prevAcromioplasty","Voorgaande operaties ",0,"","","","","","","","","LROI330","","","","","","",""]
[{"$f":"HYPERLINK(\"#'\"&Helper_Benamingen!$A166&\"'!A1\", Helper_Benamingen!B166)","v":"Herstellen van de rotator cuff"},"rotatorCuffRepair","Voorgaande operaties ",0,"","","","","","","","","LROI331","","","","","","",""]
[{"$f":"HYPERLINK(\"#'\"&Helper_Benamingen!$A167&\"'!A1\", Helper_Benamingen!B167)","v":"Distale clavicula resectie"},"prevDistalClavicleResection","Voorgaande operaties ",0,"","","","","","","","","LROI332","","","","","","",""]
[{"$f":"HYPERLINK(\"#'\"&Helper_Benamingen!$A168&\"'!A1\", Helper_Benamingen!B168)","v":"Stabilisatieprocedure"},"stabilisationProcedure","Voorgaande operaties ",0,"","","","","","","","","LROI333","","","","","","",""]
[{"$f":"HYPERLINK(\"#'\"&Helper_Benamingen!$A169&\"'!A1\", Helper_Benamingen!B169)","v":"Tenotomie bicepspees"},"tenotomyBiceps","Voorgaande operaties ",0,"","","","","","","","","LROI334","","","","","","",""]
[{"$f":"HYPERLINK(\"#'\"&Helper_Benamingen!$A170&\"'!A1\", Helper_Benamingen!B170)","v":"Tenodesis bicepspees"},"tenodesisBiceps","Voorgaande operaties ",0,"","","","","","","","","LROI335","","","","","","",""]
[{"$f":"HYPERLINK(\"#'\"&Helper_Benamingen!$A171&\"'!A1\", Helper_Benamingen!B171)","v":"Laterale artrotomie"},"arthrotomyLateral","Voorgaande operaties ",0,"","","","","","","","","","","LROI417","","","","",""]
[{"$f":"HYPERLINK(\"#'\"&Helper_Benamingen!$A172&\"'!A1\", Helper_Benamingen!B172)","v":"Mediale artrotomie"},"arthrotomyMedial","Voorgaande operaties ",0,"","","","","","","","","","","LROI418","","","","",""]
[{"$f":"HYPERLINK(\"#'\"&Helper_Benamingen!$A173&\"'!A1\", Helper_Benamingen!B173)","v":"Posterieure artrotomie"},"arthrotomyPosterior","Voorgaande operaties ",0,"","","","","","","","","","","LROI419","","","","",""]
[{"$f":"HYPERLINK(\"#'\"&Helper_Benamingen!$A174&\"'!A1\", Helper_Benamingen!B174)","v":"Decompressie ulnaire zenuw (vo)"},"decompressionUlnarNerve","Voorgaande operaties ",0,"","","","","","","","","","","LROI421","","","","",""]
[{"$f":"HYPERLINK(\"#'\"&Helper_Benamingen!$A175&\"'!A1\", Helper_Benamingen!B175)","v":"Transpositie ulnaire zenuw (vo)"},"transpositionUlnarNerve","Voorgaande operaties ",0,"","","","","","","","","","","LROI422","","","","",""]
[{"$f":"HYPERLINK(\"#'\"&Helper_Benamingen!$A176&\"'!A1\", Helper_Benamingen!B176)","v":"Radiuskopresectie (vo)"},"radialHeadResection","Voorgaande operaties ",0,"","","","","","","","","","","","LROI423","","","",""]
[{"$f":"HYPERLINK(\"#'\"&Helper_Benamingen!$A177&\"'!A1\", Helper_Benamingen!B177)","v":"Plaat- of schroefverwijdering"},"plateScrewRemoval","Voorgaande operaties ",0,"","","","","","","","","","","LROI424","","","","",""]
[{"$f":"HYPERLINK(\"#'\"&Helper_Benamingen!$A178&\"'!A1\", Helper_Benamingen!B178)","v":"Osteosynthese radius"},"osteosynthesisRadius","Voorgaande operaties ",0,"","","","","","","","","","","","","LROI511","","",""]
[{"$f":"HYPERLINK(\"#'\"&Helper_Benamingen!$A179&\"'!A1\", Helper_Benamingen!B179)","v":"Osteosynthese ulna"},"osteosynthesisUlna","Voorgaande operaties ",0,"","","","","","","","","","","","","LROI512","","",""]
[{"$f":"HYPERLINK(\"#'\"&Helper_Benamingen!$A180&\"'!A1\", Helper_Benamingen!B180)","v":"Osteosynthese carpus"},"osteosynthesisCarpus","Voorgaande operaties ",0,"","","","","","","","","","","","","LROI513","","",""]
[{"$f":"HYPERLINK(\"#'\"&Helper_Benamingen!$A181&\"'!A1\", Helper_Benamingen!B181)","v":"Correctie osteotomie radius"},"correctionOsteotomyRadius","Voorgaande operaties ",0,"","","","","","","","","","","","","LROI514","","",""]
[{"$f":"HYPERLINK(\"#'\"&Helper_Benamingen!$A182&\"'!A1\", Helper_Benamingen!B182)","v":"Correction osteotomy ulna"},"correctionOsteotomyUlna","Voorgaande operaties ",0,"","","","","","","","","","","","","LROI515","","",""]
[{"$f":"HYPERLINK(\"#'\"&Helper_Benamingen!$A183&\"'!A1\", Helper_Benamingen!B183)","v":"Proximale rij resectie"},"proximalRowResectionPrev","Voorgaande operaties ",0,"","","","","","","","","","","","","LROI516","","",""]
[{"$f":"HYPERLINK(\"#'\"&Helper_Benamingen!$A184&\"'!A1\", Helper_Benamingen!B184)","v":"Totale artrodese"},"totalArthrodesis","Voorgaande operaties ",0,"","","","","","","","","","","","","LROI517","","",""]
[{"$f":"HYPERLINK(\"#'\"&Helper_Benamingen!$A185&\"'!A1\", Helper_Benamingen!B185)","v":"Partiële artrodese"},"partialArthrodesis","Voorgaande operaties ",0,"","","","","","","","","","","","","LROI518","","",""]
[{"$f":"HYPERLINK(\"#'\"&Helper_Benamingen!$A186&\"'!A1\", Helper_Benamingen!B186)","v":"Sauvé-Kapandji"},"sauveKapanji","Voorgaande operaties ",0,"","","","","","","","","","","","","LROI519","","",""]
[{"$f":"HYPERLINK(\"#'\"&Helper_Benamingen!$A187&\"'!A1\", Helper_Benamingen!B187)","v":"Ligamentaire reconstructie"},"ligamentaryReconstruction","Voorgaande operaties ",0,"","","","","","","","","","","","","LROI520","","",""]
[{"$f":"HYPERLINK(\"#'\"&Helper_Benamingen!$A188&\"'!A1\", Helper_Benamingen!B188)","v":"Interpositie plastiek"},"interpositionArthroplasty","Voorgaande operaties ",0,"","","","","","","","","","","","","","","LROI600",""]
[{"$f":"HYPERLINK(\"#'\"&Helper_Benamingen!$A189&\"'!A1\", Helper_Benamingen!B189)","v":"Osteosynthese intra-articulaire fractuur"},"osteosynthesisIntraArticularFracture","Voorgaande operaties ",0,"","","","","","","","","","","","","","","LROI601",""]
[{"$f":"HYPERLINK(\"#'\"&Helper_Benamingen!$A190&\"'!A1\", Helper_Benamingen!B190)","v":"Plaatsing spacer"},"placementSpacer","Voorgaande operaties ",0,"","","","","","","","","","","","","","","LROI602",""]
[{"$f":"HYPERLINK(\"#'\"&Helper_Benamingen!$A191&\"'!A1\", Helper_Benamingen!B191)","v":"Andere voorgaande operaties"},"previousOperationsOther","Voorgaande operaties ",0,"","","LROI061","","LROI164","","LROI254","","LROI336","","LROI425","","LROI521","","LROI603",""]
[{"$f":"HYPERLINK(\"#'\"&Helper_Benamingen!$A192&\"'!A1\", Helper_Benamingen!B192)","v":"Andere voorgaande operaties, specificeer"},"previousOperationsSpecify","Voorgaande operaties ",0,"","","LROI062","","LROI165","","LROI255","","LROI337","","LROI426","","LROI522","","LROI604",""]
[{"$f":"HYPERLINK(\"#'\"&Helper_Benamingen!$A193&\"'!A1\", Helper_Benamingen!B193)","v":"Fixatie"},"fixation","Cement",0,"","","LROI064","LROI064","LROI166","LROI166","LROI256","LROI256","LROI338","LROI338","LROI427","LROI427","LROI523","LROI523","LROI605","LROI605"]
[{"$f":"HYPERLINK(\"#'\"&Helper_Benamingen!$A194&\"'!A1\", Helper_Benamingen!B194)","v":"Lavage"},"lavage","Cement",0,"","","LROI065","LROI065","LROI167","LROI167","LROI257","LROI257","LROI339","LROI339","LROI428","LROI428","LROI524","LROI524","",""]
[{"$f":"HYPERLINK(\"#'\"&Helper_Benamingen!$A195&\"'!A1\", Helper_Benamingen!B195)","v":"Vacuum (mix)"},"vacuumMix","Cement",0,"","","LROI066","LROI066","LROI168","LROI168","","","LROI340","LROI340","LROI429","LROI429","LROI525","LROI525","",""]
[{"$f":"HYPERLINK(\"#'\"&Helper_Benamingen!$A196&\"'!A1\", Helper_Benamingen!B196)","v":"Pressurising"},"pressurising","Cement",0,"","","LROI067","LROI067","LROI169","LROI169","","","LROI341","LROI341","LROI430","LROI430","LROI526","LROI526","",""]
[{"$f":"HYPERLINK(\"#'\"&Helper_Benamingen!$A197&\"'!A1\", Helper_Benamingen!B197)","v":"Acetabulumcomponent gecementeerd"},"acetabulumCemented","Cement",0,"","","LROI068","LROI068","","","","","","","","","","","",""]
[{"$f":"HYPERLINK(\"#'\"&Helper_Benamingen!$A198&\"'!A1\", Helper_Benamingen!B198)","v":"Femurcomponent gecementeerd"},"femurCemented","Cement",0,"","","LROI069","LROI069","LROI170","LROI170","","","","","","","","","",""]
[{"$f":"HYPERLINK(\"#'\"&Helper_Benamingen!$A199&\"'!A1\", Helper_Benamingen!B199)","v":"Cement-in-cement"},"cementInCement","Cement",0,"","","","LROI063","","","","","","","","","","","",""]
[{"$f":"HYPERLINK(\"#'\"&Helper_Benamingen!$A200&\"'!A1\", Helper_Benamingen!B200)","v":"Tibiacomponent gecementeerd"},"tibiaCemented","Cement",0,"","","","","LROI171","LROI171","","","","","","","","","",""]
[{"$f":"HYPERLINK(\"#'\"&Helper_Benamingen!$A201&\"'!A1\", Helper_Benamingen!B201)","v":"Patellacomponent gecementeerd"},"patellaCemented","Cement",0,"","","","","LROI172","LROI172","","","","","","","","","",""]
[{"$f":"HYPERLINK(\"#'\"&Helper_Benamingen!$A202&\"'!A1\", Helper_Benamingen!B202)","v":"Humeruscomponent gecementeerd"},"humerusCemented","Cement",0,"","","","","","","","","LROI342","LROI342","LROI431","LROI431","","","",""]
[{"$f":"HYPERLINK(\"#'\"&Helper_Benamingen!$A203&\"'!A1\", Helper_Benamingen!B203)","v":"Glenoïdcomponent gecementeerd"},"glenoidCemented","Cement",0,"","","","","","","","","LROI343","LROI343","","","","","",""]
[{"$f":"HYPERLINK(\"#'\"&Helper_Benamingen!$A204&\"'!A1\", Helper_Benamingen!B204)","v":"Ulnacomponent gecementeerd"},"ulnaCemented","Cement",0,"","","","","","","","","","","LROI432","LROI432","LROI528","LROI528","",""]
[{"$f":"HYPERLINK(\"#'\"&Helper_Benamingen!$A205&\"'!A1\", Helper_Benamingen!B205)","v":"Radiuscomponent gecementeerd"},"radiusCemented","Cement",0,"","","","","","","","","","","LROI433","LROI433","LROI527","LROI527","",""]
[{"$f":"HYPERLINK(\"#'\"&Helper_Benamingen!$A206&\"'!A1\", Helper_Benamingen!B206)","v":"Carpaalcomponent gecementeerd"},"carpalCemented","Cement",0,"","","","","","","","","","","","","LROI529","LROI529","",""]
[{"$f":"HYPERLINK(\"#'\"&Helper_Benamingen!$A207&\"'!A1\", Helper_Benamingen!B207)","v":"Proximale component gecementeerd"},"proximalCemented","Cement",0,"","","","","","","","","","","","","","","LROI606","LROI606"]
[{"$f":"HYPERLINK(\"#'\"&Helper_Benamingen!$A208&\"'!A1\", Helper_Benamingen!B208)","v":"Distale component gecementeerd"},"distalCemented","Cement",0,"","","","","","","","","","","","","","","LROI607","LROI607"]
[{"$f":"HYPERLINK(\"#'\"&Helper_Benamingen!$A209&\"'!A1\", Helper_Benamingen!B209)","v":"Productnummer cement 1"},"productNumberCement","Componenten",0,"","","LROI070","LROI070","LROI173","LROI173","LROI258","LROI258","LROI344","LROI344","LROI434","LROI434","LROI530","LROI530","LROI608","LROI608"]
[{"$f":"HYPERLINK(\"#'\"&Helper_Benamingen!$A210&\"'!A1\", Helper_Benamingen!B210)","v":"Lotnummer cement 1"},"lotNumberCement","Componenten",0,"","","LROI071","LROI071","LROI174","LROI174","LROI259","LROI259","LROI345","LROI345","LROI435","LROI435","LROI531","LROI531","LROI609","LROI609"]
[{"$f":"HYPERLINK(\"#'\"&Helper_Benamingen!$A211&\"'!A1\", Helper_Benamingen!B211)","v":"Productnummer cement 2"},"productNumberCement","Componenten",0,"","","LROI072","LROI072","LROI175","LROI175","LROI260","LROI260","LROI346","LROI346","LROI436","LROI436","LROI532","LROI532","LROI610","LROI610"]
[{"$f":"HYPERLINK(\"#'\"&Helper_Benamingen!$A212&\"'!A1\", Helper_Benamingen!B212)","v":"Lotnummer cement 2"},"lotNumberCement","Componenten",0,"","","LROI073","LROI073","LROI176","LROI176","LROI261","LROI261","LROI347","LROI347","LROI437","LROI437","LROI533","LROI533","LROI611","LROI611"]
[{"$f":"HYPERLINK(\"#'\"&Helper_Benamingen!$A213&\"'!A1\", Helper_Benamingen!B213)","v":"Productnummer cement 3"},"productNumberCement","Componenten",0,"","","LROI074","LROI074","LROI177","LROI177","LROI262","LROI262","LROI348","LROI348","LROI438","LROI438","LROI534","LROI534","LROI612","LROI612"]
[{"$f":"HYPERLINK(\"#'\"&Helper_Benamingen!$A214&\"'!A1\", Helper_Benamingen!B214)","v":"Lotnummer cement 3"},"lotNumberCement","Componenten",0,"","","LROI075","LROI075","LROI178","LROI178","LROI263","LROI263","LROI349","LROI349","LROI439","LROI439","LROI535","LROI535","LROI613","LROI613"]
[{"$f":"HYPERLINK(\"#'\"&Helper_Benamingen!$A215&\"'!A1\", Helper_Benamingen!B215)","v":"Productnummer cement 4"},"productNumberCement","Componenten",0,"","","LROI076","LROI076","LROI179","LROI179","LROI264","LROI264","LROI350","LROI350","LROI440","LROI440","LROI536","LROI536","LROI614","LROI614"]
[{"$f":"HYPERLINK(\"#'\"&Helper_Benamingen!$A216&\"'!A1\", Helper_Benamingen!B216)","v":"Lotnummer cement 4"},"lotNumberCement","Componenten",0,"","","LROI077","LROI077","LROI180","LROI180","LROI265","LROI265","LROI351","LROI351","LROI441","LROI441","LROI537","LROI537","LROI615","LROI615"]
["Productnummer ","productNumberAcetabularComponent1","Componenten",0,"","","LROI078","LROI078","","","","","","","","","","","",""]
["Lot nummer ","lotNumberAcetabularComponent1","Componenten",0,"","","LROI079","LROI079","","","","","","","","","","","",""]
["Meer dan 1 acetabulumcomponent?","moreAcetabularComponents","Componenten",0,"","","LROI080","LROI080","","","","","","","","","","","",""]
["Productnummer ","productNumberAcetabularComponent2","Componenten",0,"","","LROI081","LROI081","","","","","","","","","","","",""]
["Lot nummer ","lotNumberAcetabularComponent2","Componenten",0,"","","LROI082","LROI082","","","","","","","","","","","",""]
["Productnummer ","productNumberInlay","Componenten",0,"","","LROI083","LROI083","LROI191","LROI191","","","","","","","","","",""]
["Lot nummer ","lotNumberInlay","Componenten",0,"","","LROI084","LROI084","LROI192","LROI192","","","","","","","","","",""]
["Productnummer ","productNumberFemoralComponent1","Componenten",0,"","","LROI085","LROI085","LROI181","LROI181","","","","","","","","","",""]
["Lot nummer ","lotNumberFemoralComponent1","Componenten",0,"","","LROI086","LROI086","LROI182","LROI182","","","","","","","","","",""]
["Meer dan 1 femurcomponent?","moreFemoralComponents","Componenten",0,"","","LROI087","LROI087",null,null,"","","","","","","","","",""]
["Productnummer ","productNumberFemoralComponent2","Componenten",0,"","","LROI088","LROI088","LROI184","LROI184","","","","","","","","","",""]
["Lot nummer ","lotNumberFemoralComponent2","Componenten",0,"","","LROI089","LROI089","LROI185","LROI185","","","","","","","","","",""]
["Productnummer ","productNumberHead1","Componenten",0,"","","LROI090","LROI090","","","","","","","","","","","",""]
["Lot nummer ","lotNumberHead1","Componenten",0,"","","LROI091","LROI091","","","","","","","","","","","",""]
["Meer dan 1 femurkopcomponent?","moreHeads","Componenten",0,"","","LROI092","LROI092","","","","","","","","","","","",""]
["Productnummer ","productNumberHead2","Componenten",0,"","","LROI093","LROI093","","","","","","","","","","","",""]
["Lot nummer ","lotNumberHead2","Componenten",0,"","","LROI094","LROI094","","","","","","","","","","","",""]
["Meer dan 1 femoral component?","moreFemoralComponents","Componenten",0,"","",null,null,"LROI183","LROI183","","","","","","","","","",""]
["Productnummer","productNumberTibiaComponent1","Componenten",0,"","","","","LROI186","LROI186","","","","","","","","","",""]
["Lot nummer","lotNumberTibiaComponent1","Componenten",0,"","","","","LROI187","LROI187","","","","","","","","","",""]
["Meer dan 1 tibia component?","moreTibiaComponents","Componenten",0,"","","","","LROI188","LROI188","","","","","","","","","",""]
["Productnummer","productNumberTibiaComponent2","Componenten",0,"","","","","LROI189","LROI189","","","","","","","","","",""]
["Lot nummer","lotNumberTibiaComponent2","Componenten",0,"","","","","LROI190","LROI190","","","","","","","","","",""]
["Productnummer","productNumberPatellaComponent","Componenten",0,"","","","","LROI193","LROI193","","","","","","","","","",""]
["Lot nummer","lotNumberPatellaComponent","Componenten",0,"","","","","LROI194","LROI194","","","","","","","","","",""]
["Productnummer","productNumberTibialComponent","Componenten",0,"","","","","","","LROI266","LROI266","","","","","","","",""]
["Lot nummer","lotNumberTibialComponent","Componenten",0,"","","","","","","LROI267","LROI267","","","","","","","",""]
["Productnummer","productNumberTalusComponent","Componenten",0,"","","","","","","LROI268","LROI268","","","","","","","",""]
["Lot nummer","lotNumberTalusComponent","Componenten",0,"","","","","","","LROI269","LROI269","","","","","","","",""]
["Productnummer","productNumberInlayComponent","Componenten",0,"","","","","","","LROI270","LROI270","","","","","LROI546","LROI546","",""]
["Lot nummer","lotNumberInlayComponent","Componenten",0,"","","","","","","LROI271","LROI271","","","","","LROI547","LROI547","",""]
["Productnummer ","productNumberHumeralComponent","Componenten",0,"","","","","","","","","LROI352","LROI352","","","","","",""]
["Lot nummer ","lotNumberHumeralComponent","Componenten",0,"","","","","","","","","LROI353","LROI353","","","","","",""]
["Productnummer ","productNumberHumeralHead","Componenten",0,"","","","","","","","","LROI354","LROI354","","","","","",""]
["Lot nummer ","lotNumberHumeralHead","Componenten",0,"","","","","","","","","LROI355","LROI355","","","","","",""]
["Productnummer ","productNumberGlenoidCup","Componenten",0,"","","","","","","","","LROI356","LROI356","","","","","",""]
["Lot nummer ","lotNumberGlenoidCup","Componenten",0,"","","","","","","","","LROI357","LROI357","","","","","",""]
["Productnummer ","productNumberMetaphysealComponent","Componenten",0,"","","","","","","","","LROI358","LROI358","","","","","",""]
["Lot nummer ","lotNumberMetaphysealComponent","Componenten",0,"","","","","","","","","LROI359","LROI359","","","","","",""]
["Productnummer ","productNumberGlenoidLiner","Componenten",0,"","","","","","","","","LROI360","LROI360","","","","","",""]
["Lot nummer ","lotNumberGlenoidLiner","Componenten",0,"","","","","","","","","LROI361","LROI361","","","","","",""]
["Productnummer ","productNumberHumeralComponent1","Componenten",0,"","","","","","","","","","","LROI442","LROI442","","","",""]
["Lot nummer ","lotNumberHumeralComponent1","Componenten",0,"","","","","","","","","","","LROI443","LROI443","","","",""]
["Meer dan 1 humerus component?","moreHumeralComponents","Componenten",0,"","","","","","","","","","","LROI444","LROI444","","","",""]
["Productnummer ","productNumberHumeralComponent2","Componenten",0,"","","","","","","","","","","LROI445","LROI445","","","",""]
["Lot nummer ","lotNumberHumeralComponent2","Componenten",0,"","","","","","","","","","","LROI446","LROI446","","","",""]
["Productnummer ","productNumberUlnarComponent1","Componenten",0,"","","","","","","","","","","LROI447","LROI447","","","",""]
["Lot nummer ","lotNumberUlnarComponent1","Componenten",0,"","","","","","","","","","","LROI448","LROI448","","","",""]
["Meer dan 1 ulna component?","moreUlnaComponents","Componenten",0,"","","","","","","","","","","LROI449","LROI449","","","",""]
["Productnummer ","productNumberUlnarComponent2","Componenten",0,"","","","","","","","","","","LROI450","LROI450","","","",""]
["Lot nummer ","lotNumberUlnarComponent2","Componenten",0,"","","","","","","","","","","LROI451","LROI451","","","",""]
["Productnummer ","productNumberRadialHeadComponent","Componenten",0,"","","","","","","","","","","LROI452","LROI452","LROI538","LROI538","",""]
["Lot nummer ","lotNumberRadialHeadComponent","Componenten",0,"","","","","","","","","","","LROI453","LROI453","LROI539","LROI539","",""]
["Productnummer ","productNumberRadialStemComponent","Componenten",0,"","","","","","","","","","","LROI454","LROI454","LROI540","LROI540","",""]
["Lot nummer ","lotNumberRadialStemComponent","Componenten",0,"","","","","","","","","","","LROI455","LROI455","LROI541","LROI541","",""]
["Productnummer ","productNumberUlnarStemComponent","Componenten",0,"","","","","","","","","","","","","LROI542","LROI542","",""]
["Lot nummer ","lotNumberUlnarStemComponent","Componenten",0,"","","","","","","","","","","","","LROI543","LROI543","",""]
["Productnummer ","productNumberUlnarHeadComponent","Componenten",0,"","","","","","","","","","","","","LROI544","LROI544","",""]
["Lot nummer ","lotNumberUlnarHeadComponent","Componenten",0,"","","","","","","","","","","","","LROI545","LROI545","",""]
["Productnummer ","productNumberInlayComponent","Componenten",0,"","","","","","","LROI270","LROI270","","","","","LROI546","LROI546","",""]
["Lot nummer ","lotNumberInlayComponent","Componenten",0,"","","","","","","LROI271","LROI271","","","","","LROI547","LROI547","",""]
["Productnummer ","productNumberCarpalComponent1","Componenten",0,"","","","","","","","","","","","","LROI548","LROI548","",""]
["Lot nummer ","lotNumberCarpalComponent1","Componenten",0,"","","","","","","","","","","","","LROI549","LROI549","",""]
["Productnummer ","productNumberCarpalComponent2","Componenten",0,"","","","","","","","","","","","","LROI550","LROI550","",""]
["Lot nummer ","lotNumberCarpalComponent2","Componenten",0,"","","","","","","","","","","","","LROI551","LROI551","",""]
["Productnummer ","productNumberCarpalComponent3","Componenten",0,"","","","","","","","","","","","","LROI552","LROI552","",""]
["Lot nummer ","lotNumberCarpalComponent3","Componenten",0,{"$f":"IF(NOT(ISERROR(LEFT(E286, FIND(\" \",E286)-1))), LEFT(E286, FIND(\" \",E286)-1), E286)","v":""},null,null,null,null,null,null,null,null,null,null,null,"LROI553","LROI553"]
["Productnummer ","productNumberProximalStemComponent","Componenten",0,"","","","","","","","","","","","","","","LROI616","LROI616"]
["Lot nummer ","lotNumberProximalStemComponent","Componenten",0,"","","","","","","","","","","","","","","LROI617","LROI617"]
["Productnummer ","productNumberProximalHeadComponent","Componenten",0,"","","","","","","","","","","","","","","LROI618","LROI618"]
["Lot nummer ","lotNumberProximalHeadComponent","Componenten",0,"","","","","","","","","","","","","","","LROI619","LROI619"]
["Productnummer ","productNumberDistalStemComponent","Componenten",0,"","","","","","","","","","","","","","","LROI620","LROI620"]
["Lot nummer ","lotNumberDistalStemComponent","Componenten",0,"","","","","","","","","","","","","","","LROI621","LROI621"]
["Productnummer ","productNumberDistalHeadComponent","Componenten",0,"","","","","","","","","","","","","","","LROI622","LROI622"]
["Lot nummer ","lotNumberDistalHeadComponent","Componenten",0,"","","","","","","","","","","","","","","LROI623","LROI623"]
["Productnummer (code)","code","Componenten",0,"","","LROI095","LROI095","LROI195","LROI195","LROI272","LROI272","LROI362","LROI362","LROI456","LROI456","LROI554","LROI554","LROI624","LROI624"]
["Lot nummer","lotNumber","Componenten",0,"","","LROI096","LROI096","LROI196","LROI196","LROI273","LROI273","LROI363","LROI363","LROI457","LROI457","LROI555","LROI555","LROI625","LROI625"]

{"sheet":"LROI nummer","index":3,"n_rows":23,"n_cols":2,"rows_kept":23,"cut":false,"hidden":false,"merged":[]}
["DATA_ID","LROI1"]
["LROI uitvraag","LROI nummer"]
["Variabelenaam XML"]
["Variabelenaam database","lroi_number"]
["Label EN","LROI nummer "]
["Label NL","LROI nummer "]
["Definitie","LROI patiëntnummer"]
["Doel / reden uitvraag","Automatisch gegenereerd nummer die de patiënt krijgt bij aanmaak van een nieuwe patiënt in de LROI. Met die nummer kan veilig gecommuniceerd worden, uit het oogpunt van privacybescherming, tussen zorgaanbieder en LROI."]
["Waarde verplicht","Automatisch gegenereerd"]
["Datatype","Integer (INT)"]
["Domein (acceptabele range, min-max)"]
["Eenheid"]
["Format (max. lengte)",9]
["Decimalen"]
["Codering"]
["Periode","Sinds start registratie"]
["Wijziging (datum en reden)"]
["Noodzakelijk voor kwaliteitsindicatoren"]
["Opmerkingen","De combinatie van de zorgaanbieder (LROI ziekenhuisnummer) en de patiënt (LROI patiëntnummer) is uniek"]
["Zorg Informatie Bouwsteen (ZIB)","Geen ZIB"]
["Voorbeeld"]
[]
["Terug naar Overzicht"]

{"sheet":"Overzicht_unique","index":4,"n_rows":320,"n_cols":36,"rows_kept":320,"cut":false,"hidden":true,"merged":[]}
["Label NL","Variabelenaam (XML)","Sectie","Verplicht","Patient \nPrimair","Patient \nRevisie","Heup Primair","Heup Revisie","Knie \nPrimair","Knie \nRevisie","Enkel Primair","Enkel Revisie","Schouder Primair","Schouder Revisie","Elleboog Primair","Elleboog Revisie","Pols \nPrimair","Pols \nRevisie","Vinger Primair","Vinger Revisie",null,"Unique values","Unique values","Unique values","Unique values","Unique values","Unique values","Unique values","Unique values","Unique values","Unique values","Unique values","Unique values","Unique values","Unique values","CONCATENATE()"]
[0,0,0,0,"Patient","Patient","Heup","Heup","Knie","Knie","Enkel","Enkel","Schouder","Schouder","Elleboog","Elleboog","Pols","Pols","Vinger","Vinger",null,"Patient","Heup","Knie","Enkel","Schouder","Elleboog","Pols","Vinger",null,null,null,null,null,null,"Patient, Heup, Knie, Enkel, Schouder, Elleboog, Pols, Vinger"]
[0,0,0,0,"Primary","Revision","Primary","Revision","Primary","Revision","Primary","Revision","Primary","Revision","Primary","Revision","Primary","Revision","Primary","Revision",null,"Primary","Revision",null,null,null,null,null,null,null,null,null,null,null,null,"Primary, Revision"]
["LROI nummer"," ","Index administratie","n.v.t.","","","","","","","","","","","","","","","","",null,{"$error":"#VALUE!"},null,null,null,null,null,null,null,null,null,null,null,null,null,{"$error":"#VALUE!"}]
["Ziekenhuispatiëntnummer","patientnumber","Patiënt ",1,"LROI002","LROI002",null,"","","","","","","","","","","","","",null,"LROI002",0,null,null,null,null,null,null,null,null,null,null,null,null,"LROI002"]
["Burger Service Nummer ","bsn","Patiënt",0,"LROI003","LROI003","","","","","","","","","","","","","","",null,"LROI003",null,null,null,null,null,null,null,null,null,null,null,null,null,"LROI003"]
["Geslacht","gender","Patiënt",1,"LROI004","LROI004","","","","","","","","","","","","","","",null,"LROI004",null,null,null,null,null,null,null,null,null,null,null,null,null,"LROI004"]
["Geboortedatum","birthdate","Patiënt",1,"LROI005","LROI005","","","","","","","","","","","","","","",null,"LROI005",null,null,null,null,null,null,null,null,null,null,null,null,null,"LROI005"]
["Overlijdensdatum","deathdate","Patiënt",0,"LROI006","LROI006","","","","","","","","","","","","","","",null,"LROI006",null,null,null,null,null,null,null,null,null,null,null,null,null,"LROI006"]
["Ziekenhuisnummer","hospitalId","Patiënt","n.v.t.","LROI007","LROI007","","","","","","","","","","","","","","",null,"LROI007",null,null,null,null,null,null,null,null,null,null,null,null,null,"LROI007"]
["Operatietype","procedureType","Algemene informatie",1,"","","LROI008","LROI008","LROI097","LROI097","LROI197","LROI197","LROI274","LROI274","LROI364","LROI364","LROI458","LROI458","LROI556","LROI556",null,"LROI008","LROI097","LROI197","LROI274","LROI364","LROI458","LROI556",null,null,null,null,null,null,null,"LROI008, LROI097, LROI197, LROI274, LROI364, LROI458, LROI556"]
["Operatiedatum","procedureDate","Algemene informatie",1,"","","LROI009","LROI009","LROI098","LROI098","LROI198","LROI198","LROI275","LROI275","LROI365","LROI365","LROI459","LROI459","LROI557","LROI557",null,"LROI009","LROI098","LROI198","LROI275","LROI365","LROI459","LROI557",null,null,null,null,null,null,null,"LROI009, LROI098, LROI198, LROI275, LROI365, LROI459, LROI557"]
["Ziekenhuis waar operatie heeft plaatsgevonden","implantingProcedureHospital","Algemene informatie",1,"","","LROI010","LROI010","LROI099","LROI099","LROI199","LROI199","LROI276","LROI276","LROI366","LROI366","LROI460","LROI460","LROI558","LROI558",null,"LROI010","LROI099","LROI199","LROI276","LROI366","LROI460","LROI558",null,null,null,null,null,null,null,"LROI010, LROI099, LROI199, LROI276, LROI366, LROI460, LROI558"]
["Operatiezijde","procedureSide","Algemene informatie",1,"","","LROI011","LROI011","LROI100","LROI100","LROI200","LROI200","LROI277","LROI277","LROI367","LROI367","LROI461","LROI461","LROI559","LROI559",null,"LROI011","LROI100","LROI200","LROI277","LROI367","LROI461","LROI559",null,null,null,null,null,null,null,"LROI011, LROI100, LROI200, LROI277, LROI367, LROI461, LROI559"]
["Positie prothese","prosthesisPosition","Algemene informatie",1,"","","","","","","","","","","","","","","LROI560","LROI560",null,"LROI560",null,null,null,null,null,null,null,null,null,null,null,null,null,"LROI560"]
["Locatie prothese","prosthesisLocation","Algemene informatie",1,"","","","","","","","","","","","","","","LROI561","LROI561",null,"LROI561",null,null,null,null,null,null,null,null,null,null,null,null,null,"LROI561"]
["Postcode","patientPostalcode","Patiënt ",0,"","","LROI012","LROI012","LROI101","LROI101","LROI201","LROI201","LROI278","LROI278","LROI368","LROI368","LROI462","LROI462","LROI562","LROI562",null,"LROI012","LROI101","LROI201","LROI278","LROI368","LROI462","LROI562",null,null,null,null,null,null,null,"LROI012, LROI101, LROI201, LROI278, LROI368, LROI462, LROI562"]
["Buitenlandse postcode","foreignPostalCode","Patiënt",0,"","","LROI013","LROI013","LROI102","LROI102","LROI202","LROI202","LROI279","LROI279","LROI369","LROI369","LROI463","LROI463","LROI563","LROI563",null,"LROI013","LROI102","LROI202","LROI279","LROI369","LROI463","LROI563",null,null,null,null,null,null,null,"LROI013, LROI102, LROI202, LROI279, LROI369, LROI463, LROI563"]
["Lichaamslengte","patientLength","Patiënt",0,"","","LROI014","LROI014","LROI103","LROI103","LROI203","LROI203","LROI280","LROI280","LROI370","LROI370","LROI464","LROI464","LROI564","LROI564",null,"LROI014","LROI103","LROI203","LROI280","LROI370","LROI464","LROI564",null,null,null,null,null,null,null,"LROI014, LROI103, LROI203, LROI280, LROI370, LROI464, LROI564"]
["Lichaamsgewicht","patientWeight","Patiënt",0,"","","LROI015","LROI015","LROI104","LROI104","LROI204","LROI204","LROI281","LROI281","LROI371","LROI371","LROI465","LROI465","LROI565","LROI565",null,"LROI015","LROI104","LROI204","LROI281","LROI371","LROI465","LROI565",null,null,null,null,null,null,null,"LROI015, LROI104, LROI204, LROI281, LROI371, LROI465, LROI565"]
["Roken","patientSmoking","Patiënt",0,"","","LROI016","LROI016","LROI105","LROI105","LROI205","LROI205","LROI282","LROI282","LROI372","LROI372","LROI466","LROI466","LROI566","LROI566",null,"LROI016","LROI105","LROI205","LROI282","LROI372","LROI466","LROI566",null,null,null,null,null,null,null,"LROI016, LROI105, LROI205, LROI282, LROI372, LROI466, LROI566"]
["BMI","patientBmi","Patiënt",0,"","","LROI017","LROI017","LROI106","LROI106","LROI206","LROI206","LROI283","LROI283","LROI373","LROI373","LROI467","LROI467","LROI567","LROI567",null,"LROI017","LROI106","LROI206","LROI283","LROI373","LROI467","LROI567",null,null,null,null,null,null,null,"LROI017, LROI106, LROI206, LROI283, LROI373, LROI467, LROI567"]
["Voorkeurshand","handedness","Patiënt",0,"",null,null,"","","","","","LROI284","LROI284","LROI374","LROI374","LROI468","LROI468","LROI568","LROI568",null,null,null,null,null,null,null,null,null,null,null,null,null,null,null,"LROI284, LROI374, LROI468, LROI568"]
["Diagnose","diagnosis","Diagnose ",0,"","","LROI018","","LROI107","","LROI207","","LROI285","","LROI375","","LROI469","","LROI59","",null,"LROI018","LROI107","LROI207","LROI285","LROI375","LROI469","LROI59",null,null,null,null,null,null,null,"LROI018, LROI107, LROI207, LROI285, LROI375, LROI469, LROI59"]
["Andere diagnose, specificeer","diagnosisOther","Diagnose ",0,"","","LROI019","","LROI108","","LROI208","","LROI286","","LROI376","","LROI470","","LROI570","",null,"LROI019","LROI108","LROI208","LROI286","LROI376","LROI470","LROI570",null,null,null,null,null,null,null,"LROI019, LROI108, LROI208, LROI286, LROI376, LROI470, LROI570"]
["Locatie artrose","locationOsteoarthritis","Diagnose ",0,"",null,null,null,"LROI109",null,null,null,null,null,null,null,null,null,null,null,null,null,null,null,null,null,null,null,null,null,null,null,null,null,null,"LROI109"]
["ASA classificatie","asaClassification","Diagnose / Reden voor revisie",0,"","","LROI020","LROI020","LROI110","LROI110","LROI209","LROI209","LROI287","LROI287","LROI377","LROI377","LROI471","LROI471","LROI571","LROI571",null,"LROI020","LROI110","LROI209","LROI287","LROI377","LROI471","LROI571",null,null,null,null,null,null,null,"LROI020, LROI110, LROI209, LROI287, LROI377, LROI471, LROI571"]
["Charnley classificatie","charnleyClassification","Diagnose / Reden voor revisie",0,"","","LROI021","LROI021","LROI111","LROI111","LROI210","LROI210","","","","","","","","",null,"LROI021","LROI111","LROI210",null,null,null,null,null,null,null,null,null,null,null,"LROI021, LROI111, LROI210"]
["Walch classificatie","walch","Diagnose",0,"","","","","","","","","LROI288","","","","","","","",null,"LROI288",null,null,null,null,null,null,null,null,null,null,null,null,null,"LROI288"]
["Infectie","infection","Reden voor revisie",0,"","","","LROI022","","LROI112","","LROI211","","LROI289","","LROI378","","LROI472","","",null,"LROI022","LROI112","LROI211","LROI289","LROI378","LROI472",null,null,null,null,null,null,null,null,"LROI022, LROI112, LROI211, LROI289, LROI378, LROI472"]
["Slijtage cup/lager","cupLinerWear","Reden voor revisie",0,"","","","LROI023","","","","","","","","","","","","",null,"LROI023",null,null,null,null,null,null,null,null,null,null,null,null,null,"LROI023"]
["Slijtage van insert","wearInlay","Reden voor revisie",0,"","","","","","LROI115","","","","","","","","","","",null,"LROI115",null,null,null,null,null,null,null,null,null,null,null,null,null,"LROI115"]
["Slijtage inlay","wearOfInlay","Reden voor revisie",0,"","","","","","","","LROI212","","","","","","","","",null,"LROI212",null,null,null,null,null,null,null,null,null,null,null,null,null,"LROI212"]
["Slijtage van polyethyleen","polyethyleneWear","Reden voor revisie",0,"","","","","","","","","","","","LROI379","","","","",null,"LROI379",null,null,null,null,null,null,null,null,null,null,null,null,null,"LROI379"]
["Periprothetische fractuur","periprostheticFracture","Reden voor revisie",0,"","","","LROI024","","LROI116","","LROI213","","LROI290","","LROI380","","LROI473","","",null,"LROI024","LROI116","LROI213","LROI290","LROI380","LROI473",null,null,null,null,null,null,null,null,"LROI024, LROI116, LROI213, LROI290, LROI380, LROI473"]
["Malpositie of malalignment","malalignment","Reden voor revisie",0,"","","","LROI025","","LROI117","",null,"","LROI291","","LROI381","","LROI476","","LROI572",null,"LROI025","LROI117","LROI214","LROI291","LROI381","LROI476","LROI572",null,null,null,null,null,null,null,"LROI025, LROI117, LROI291, LROI381, LROI476, LROI572"]
["Malalignment","malalignment","Reden voor revisie",0,"","","",null,null,null,"","LROI214","",null,null,null,null,null,null,null,null,"LROI025","LROI117","LROI214","LROI291","LROI381","LROI476","LROI572",null,null,null,null,null,null,null,"LROI214"]
["Malpositie","malposition","Reden voor revisie",0,"","","","","","","","LROI215","","","","","","","","",null,"LROI215",null,null,null,null,null,null,null,null,null,null,null,null,null,"LROI215"]
["Luxatie","dislocation","Reden voor revisie",0,"","","","LROI026","","","","","","","","","","LROI475","","LROI574",null,"LROI026","LROI475","LROI574",null,null,null,null,null,null,null,null,null,null,null,"LROI026, LROI475, LROI574"]
["Luxatie patella","patellaDislocation","Reden voor revisie",0,"","","","","","LROI113","","","","","","","","","","",null,"LROI113",null,null,null,null,null,null,null,null,null,null,null,null,null,"LROI113"]
["Luxatie bearing","bearingDislocation","Reden voor revisie",0,"","","","","","LROI114","","","","","","","","","","",null,"LROI114",null,null,null,null,null,null,null,null,null,null,null,null,null,"LROI114"]
["Instabiliteit of dislocatie","instability","Reden voor revisie",0,"","","","","","LROI118","",null,"","LROI292","","LROI382","","LROI474","","LROI573",null,"LROI118","LROI216","LROI292","LROI382","LROI474","LROI573",null,null,null,null,null,null,null,null,"LROI118, LROI292, LROI382, LROI474, LROI573"]
["Instabiliteit","instability","Reden voor revisie",0,"","","","","",null,"","LROI216","",null,null,null,null,null,null,null,null,"LROI118","LROI216","LROI292","LROI382","LROI474","LROI573",null,null,null,null,null,null,null,null,"LROI216"]
["Peri-articulaire ossificatie","periArticularOssification","Reden voor revisie",0,"","","","LROI027","","","","","","","","","","","","",null,"LROI027",null,null,null,null,null,null,null,null,null,null,null,null,null,"LROI027"]
["Artrofibrose","arthrofibrosis","Reden voor revisie",0,"","","","","","LROI119","","LROI219","","","","","","","","",null,"LROI119","LROI219",null,null,null,null,null,null,null,null,null,null,null,null,"LROI119, LROI219"]
["Cuff artropathie","cuffArthropathy","Reden voor revisie",0,"","","","","","","","","","LROI293","","","","","","",null,"LROI293",null,null,null,null,null,null,null,null,null,null,null,null,null,"LROI293"]
["Onherstelbare cuff ruptuur","cuffRupture","Reden voor revisie",0,"","","","","","","","","","LROI294","","","","","","",null,"LROI294",null,null,null,null,null,null,null,null,null,null,null,null,null,"LROI294"]
["Metallose","metallosis","Reden voor revisie",0,"","","","","","","","","","","","LROI383","","","","",null,"LROI383",null,null,null,null,null,null,null,null,null,null,null,null,null,"LROI383"]
["Implantaatbreuk","implantBreakage","Reden voor revisie",0,"","","","","","","","","","","","","","LROI477","","LROI575",null,"LROI477","LROI575",null,null,null,null,null,null,null,null,null,null,null,null,"LROI477, LROI575"]
["Loslating acetabulumcomponent","looseningAcetabularComponent","Reden voor revisie",0,"","","","LROI028","","","","","","","","","","","","",null,"LROI028",null,null,null,null,null,null,null,null,null,null,null,null,null,"LROI028"]
["Loslating femurcomponent","looseningFemoralComponent","Reden voor revisie",0,"","","","LROI029","","LROI120","","","","","","","","","","",null,"LROI029","LROI120",null,null,null,null,null,null,null,null,null,null,null,null,"LROI029, LROI120"]
["Loslating tibiacomponent","looseningTibialComponent","Reden voor revisie",0,"","","","","","LROI121","","LROI217","","","","","","","","",null,"LROI121","LROI217",null,null,null,null,null,null,null,null,null,null,null,null,"LROI121, LROI217"]
["Loslating patellacomponent","looseningPatellarComponent","Reden voor revisie",0,"","","","","","LROI122","","","","","","","","","","",null,"LROI122",null,null,null,null,null,null,null,null,null,null,null,null,null,"LROI122"]
["Loslating taluscomponent","looseningTalusComponent","Reden voor revisie",0,"","","","","","","","LROI218","","","","","","","","",null,"LROI218",null,null,null,null,null,null,null,null,null,null,null,null,null,"LROI218"]
["Loslating humeruscomponent","looseningHumeralComponent","Reden voor revisie",0,"","","","","","","","","","LROI295","","LROI384","","","","",null,"LROI295","LROI384",null,null,null,null,null,null,null,null,null,null,null,null,"LROI295, LROI384"]
["Loslating glenoïdcomponent","looseningGlenoidComponent","Reden voor revisie",0,"","","","","","","","","","LROI296","","","","","","",null,"LROI296",null,null,null,null,null,null,null,null,null,null,null,null,null,"LROI296"]
["Loslating ulnacomponent","looseningUlnarComponent","Reden voor revisie",0,"","","","","","","","","","","","LROI385","","LROI479","","",null,"LROI385","LROI479",null,null,null,null,null,null,null,null,null,null,null,null,"LROI385, LROI479"]
["Loslating radiuscomponent","looseningRadialComponent","Reden voor revisie",0,"","","","","","","","","","","","","","LROI478","","",null,"LROI478",null,null,null,null,null,null,null,null,null,null,null,null,null,"LROI478"]
["Loslating carpaalcomponent","looseningCarpalComponent ","Reden voor revisie",0,"","","","","","","","","","","","","","LROI480","","",null,"LROI480",null,null,null,null,null,null,null,null,null,null,null,null,null,"LROI480"]
["Loslating proximale component","looseningProximalComponent","Reden voor revisie",0,"","","","","","","","","","","","","","","","LROI576",null,"LROI576",null,null,null,null,null,null,null,null,null,null,null,null,null,"LROI576"]
["Loslating distale component","looseningDistalComponent","Reden voor revisie",0,"","","","","","","","","","","","","","","","LROI577",null,"LROI577",null,null,null,null,null,null,null,null,null,null,null,null,null,"LROI577"]
["Symptomatische MoM articulatie","symptomaticMomBearing","Reden voor revisie",0,"","","","LROI030","","","","","","","","","","","","",null,"LROI030",null,null,null,null,null,null,null,null,null,null,null,null,null,"LROI030"]
["Progressie van artrose (partiële knieprothese)","progressionOsteoarthritis","Reden voor revisie",0,"","","","","","LROI123","","","","","","","","","","",null,"LROI123",null,null,null,null,null,null,null,null,null,null,null,null,null,"LROI123"]
["Progressie van glenoïd artrose","progressionGlenoidOsteoarthritis","Reden voor revisie",0,"","","","","","","","","","LROI297","","","","","","",null,"LROI297",null,null,null,null,null,null,null,null,null,null,null,null,null,"LROI297"]
["Pijn","pain","Reden voor revisie",0,"","","","","","LROI125","","","","","","","","","","",null,"LROI125",null,null,null,null,null,null,null,null,null,null,null,null,null,"LROI125"]
["Cystevorming","cysteFormation","Reden voor revisie",0,"","","","","","","","LROI220","","","","","","","","",null,"LROI220",null,null,null,null,null,null,null,null,null,null,null,null,null,"LROI220"]
["Mechanische complicatie radiuskopprothese","mechComplRadialHead","Reden voor revisie",0,"","","","","","","","","","","","LROI386","","","","",null,"LROI386",null,null,null,null,null,null,null,null,null,null,null,null,null,"LROI386"]
["Botresorptie rondom radiuscomponent","boneResorptionRadialComp","Reden voor revisie",0,"","","","","","","","","","","","","","LROI481","","",null,"LROI481",null,null,null,null,null,null,null,null,null,null,null,null,null,"LROI481"]
["Botresorptie rondom ulnacomponent","boneResorptionUlnarComp","Reden voor revisie",0,"","","","","","","","","","","","","","LROI482","","",null,"LROI482",null,null,null,null,null,null,null,null,null,null,null,null,null,"LROI482"]
["Botresorptie rondom carpaalcomponent","boneResorptionCarpalComp","Reden voor revisie",0,"","","","","","","","","","","","","","LROI483","","",null,"LROI483",null,null,null,null,null,null,null,null,null,null,null,null,null,"LROI483"]
["Botresorptie rondom proximale component","boneResorptionProximal","Reden voor revisie",0,"","","","","","","","","","","","","","","","LROI578",null,"LROI578",null,null,null,null,null,null,null,null,null,null,null,null,null,"LROI578"]
["Botresorptie rondom distale component","boneResorptionDistal","Reden voor revisie",0,"","","","","","","","","","","","","","","","LROI579",null,"LROI579",null,null,null,null,null,null,null,null,null,null,null,null,null,"LROI579"]
["Status na heupprothese-verwijdering (Girdlestone)","revisionAfterHipRemoval","Reden voor revisie",0,"","","","LROI031","","","","","","","","","","","","",null,"LROI031",null,null,null,null,null,null,null,null,null,null,null,null,null,"LROI031"]
["Status na knieprotheseverwijdering","revisionAfterKneeRemoval","Reden voor revisie",0,"","","","","","LROI124","","","","","","","","","","",null,"LROI124",null,null,null,null,null,null,null,null,null,null,null,null,null,"LROI124"]
["Status na enkelprotheseverwijdering","revisionAfterAnkleRemoval","Reden voor revisie",0,"","","","","","","","LROI221","","","","","","","","",null,"LROI221",null,null,null,null,null,null,null,null,null,null,null,null,null,"LROI221"]
["Status na schouderprotheseverwijdering","revisionAfterShoulderRemoval","Reden voor revisie",0,"","","","","","","","","","LROI298","","","","","","",null,"LROI298",null,null,null,null,null,null,null,null,null,null,null,null,null,"LROI298"]
["Status na elleboogprotheseverwijdering","revisionAfterElbowRemoval","Reden voor revisie",0,"","","","","","","","","","","","LROI387","","","","",null,"LROI387",null,null,null,null,null,null,null,null,null,null,null,null,null,"LROI387"]
["Status na polsprotheseverwijdering","revisionAfterWristRemoval","Reden voor revisie",0,"","","","","","","","","","","","","","LROI484","","",null,"LROI484",null,null,null,null,null,null,null,null,null,null,null,null,null,"LROI484"]
["Status na vingerprotheseverwijdering","revisionAfterFingerRemoval","Reden voor revisie",0,"","","","","","","","","","","","","","","","LROI580",null,"LROI580",null,null,null,null,null,null,null,null,null,null,null,null,null,"LROI580"]
["Andere reden voor revisie","otherReasonForRevision","Reden voor revisie",0,"","","","LROI032","","LROI126","","LROI222","","LROI299","","LROI388","","LROI485","","LROI581",null,"LROI032","LROI126","LROI222","LROI299","LROI388","LROI485","LROI581",null,null,null,null,null,null,null,"LROI032, LROI126, LROI222, LROI299, LROI388, LROI485, LROI581"]
["Andere reden voor revisie, specificeer","reasonRevisionOther","Reden voor revisie",0,"","","","LROI033","","LROI127","","LROI223","","LROI300","","LROI389","","LROI486","","LROI582",null,"LROI033","LROI127","LROI223","LROI300","LROI389","LROI486","LROI582",null,null,null,null,null,null,null,"LROI033, LROI127, LROI223, LROI300, LROI389, LROI486, LROI582"]
["Specialisme","specialism","Type operatie",0,"","","LROI043","LROI043","","","","","LROI301","LROI301","LROI394","LROI394","LROI497","LROI497","LROI588","LROI588",null,"LROI043","LROI301","LROI394","LROI497","LROI588",null,null,null,null,null,null,null,null,null,"LROI043, LROI301, LROI394, LROI497, LROI588"]
["BIG hoofdoperateur","surgeonCode","Type operatie",0,"","","LROI044","LROI044","LROI143","LROI143","LROI232","LROI232","LROI302","LROI302","LROI395","LROI395","LROI498","LROI498","LROI589","LROI589",null,"LROI044","LROI143","LROI232","LROI302","LROI395","LROI498","LROI589",null,null,null,null,null,null,null,"LROI044, LROI143, LROI232, LROI302, LROI395, LROI498, LROI589"]
["BIG assisterend chirurg","assistantSurgeonCode","Type operatie",0,"","","LROI045","LROI045","LROI144","LROI144","LROI233","LROI233","LROI303","LROI303","LROI396","LROI396","LROI499","LROI499","LROI590","LROI590",null,"LROI045","LROI144","LROI233","LROI303","LROI396","LROI499","LROI590",null,null,null,null,null,null,null,"LROI045, LROI144, LROI233, LROI303, LROI396, LROI499, LROI590"]
["Type prothese","prosthesisType","Type operatie",0,"","","LROI034","","LROI128","","LROI224","","LROI304","","LROI390","","LROI487","","","",null,"LROI034","LROI128","LROI224","LROI304","LROI390","LROI487",null,null,null,null,null,null,null,null,"LROI034, LROI128, LROI224, LROI304, LROI390, LROI487"]
["Ander type prothese, specificeer","prosthesisOther","Type operatie",0,"","","LROI035","","LROI129","","LROI225","","LROI305","","LROI391","","LROI488","","","",null,"LROI035","LROI129","LROI225","LROI305","LROI391","LROI488",null,null,null,null,null,null,null,null,"LROI035, LROI129, LROI225, LROI305, LROI391, LROI488"]
["Indien unicondylair, zijde prothese","unicondylar","Type operatie",0,"","","","","LROI130","","","","","","","","","","","",null,"LROI130",null,null,null,null,null,null,null,null,null,null,null,null,null,"LROI130"]
["Plaatsing patellacomponent","patellaComponent","Type operatie",0,"","","","","LROI131","","","","","","","","","","","",null,"LROI131",null,null,null,null,null,null,null,null,null,null,null,null,null,"LROI131"]
["Radiuskopcomponent geplaatst","radialHeadComp","Type operatie",0,"","","","","","","","","","","LROI392","","","","","",null,"LROI392",null,null,null,null,null,null,null,null,null,null,null,null,null,"LROI392"]
["Prothese gelinkt","prosthesisLinked","Type operatie",0,"","","","","","","","","","","LROI393","","","","","",null,"LROI393",null,null,null,null,null,null,null,null,null,null,null,null,null,"LROI393"]
["Gereviseerde prothese","revisedProsthesis","Type operatie",0,"",null,"","","","","","",null,"LROI306","","","","","","",null,null,null,null,null,null,null,null,null,null,null,null,null,null,null,"LROI306"]
["Type humerale component van gereviseerde prothese","humeralComponent","Type operatie",0,"",null,"","","","","","",null,"LROI307","","","","","","",null,null,null,null,null,null,null,null,null,null,null,null,null,null,null,"LROI307"]
["Type revisie","revisionType","Type operatie",0,"","","","LROI036","","LROI132","","LROI226","","LROI308","","LROI397","","LROI489","","LROI583",null,"LROI036","LROI132","LROI226","LROI308","LROI397","LROI489","LROI583",null,null,null,null,null,null,null,"LROI036, LROI132, LROI226, LROI308, LROI397, LROI489, LROI583"]
["Ander type revisie, specificeer","revisionOther","Type operatie",0,"","","","LROI037","","LROI133","","LROI227","","LROI309","","LROI398","","LROI490","","LROI584",null,"LROI037","LROI133","LROI227","LROI309","LROI398","LROI490","LROI584",null,null,null,null,null,null,null,"LROI037, LROI133, LROI227, LROI309, LROI398, LROI490, LROI584"]
["Conversie naar totale heupprothese","conversionToTotalHip","Type operatie",0,"","","","LROI038","","","","","","","","","","","","",null,"LROI038",null,null,null,null,null,null,null,null,null,null,null,null,null,"LROI038"]
["Amputatie","amputation","Type operatie",0,"","","","","","LROI134","","LROI228","","LROI310","","LROI399","","LROI492","","LROI585",null,"LROI134","LROI228","LROI310","LROI399","LROI492","LROI585",null,null,null,null,null,null,null,null,"LROI134, LROI228, LROI310, LROI399, LROI492, LROI585"]
["Conversie naar totale knieprothese","conversionTotalKnee","Type operatie",0,"","","","","","LROI135","","","","","","","","","","",null,"LROI135",null,null,null,null,null,null,null,null,null,null,null,null,null,"LROI135"]
["Conversie van hemi naar totale schouderprothese","conversionHemiToTotal","Type operatie",0,"","","","","","","","","","LROI311","","","","","","",null,"LROI311",null,null,null,null,null,null,null,null,null,null,null,null,null,"LROI311"]
["Conversie van totale naar hemischouderprothese","conversionTotalToHemi","Type operatie",0,"","","","","","","","","","LROI312","","","","","","",null,"LROI312",null,null,null,null,null,null,null,null,null,null,null,null,null,"LROI312"]
["Conversie naar totale elleboogprothese","conversionToTotalElbow","Type operatie",0,"","","","","","","","","","","","LROI400","","","","",null,"LROI400",null,null,null,null,null,null,null,null,null,null,null,null,null,"LROI400"]
["Patellacomponent (bij)geplaatst","patellaComponent","Type operatie",0,"","","","","LROI136","","","","","","","","","","","",null,"LROI131",null,null,null,null,null,null,null,null,null,null,null,null,null,"LROI136"]
["Unicompartimentele prothese  bijgeplaatst","uniProsthesisAdded","Type operatie",0,"","","","","","LROI137","","","","","","","","","","",null,"LROI137",null,null,null,null,null,null,null,null,null,null,null,null,null,"LROI137"]
["VKB functioneel intact","anteriorCrucLig","Type operatie",0,"","","","","","LROI138","","","","","","","","","","",null,"LROI138",null,null,null,null,null,null,null,null,null,null,null,null,null,"LROI138"]
["Radiuskopresectie","radialHeadResection","Type operatie",0,"","","","","","","","","","","","LROI401","","","","",null,"LROI401",null,null,null,null,null,null,null,null,null,null,null,null,null,"LROI401"]
["Linking ulnar cap","ulnarCap","Type operatie",0,"","","","","","","","","","","","LROI402","","","","",null,"LROI402",null,null,null,null,null,null,null,null,null,null,null,null,null,"LROI402"]
["Acetabulumcomponent gereviseerd","acetabulumRevised","Type operatie",0,"","","","LROI039","","","","","","","","","","","","",null,"LROI039",null,null,null,null,null,null,null,null,null,null,null,null,null,"LROI039"]
["Inlay/lager gereviseerd","inlayRevised","Type operatie",0,"","","","LROI040","",null,null,null,null,null,null,null,null,null,"","",null,"LROI040","LROI141","LROI231","LROI495",null,null,null,null,null,null,null,null,null,null,"LROI040"]
["Femurkopcomponent gereviseerd","headRevised","Type operatie",0,"","","","LROI041","","","","","","","","","","","","",null,"LROI041",null,null,null,null,null,null,null,null,null,null,null,null,null,"LROI041"]
["Femurcomponent gereviseerd","femurRevised","Type operatie",0,"","","","LROI042","","LROI139","","","","","","","","","","",null,"LROI042","LROI139",null,null,null,null,null,null,null,null,null,null,null,null,"LROI042, LROI139"]
["Tibiacomponent gereviseerd","tibiaRevised","Type operatie",0,"","","","","","LROI140","","LROI229","","","","","","","","",null,"LROI140","LROI229",null,null,null,null,null,null,null,null,null,null,null,null,"LROI140, LROI229"]
["Inlay gereviseerd","inlayRevised","Type operatie",0,"","","",null,"","LROI141","","LROI231","","","","","","LROI495","","",null,"LROI040","LROI141","LROI231","LROI495",null,null,null,null,null,null,null,null,null,null,"LROI141, LROI231, LROI495"]
["Patellacomponent gereviseerd","patellaRevised","Type operatie",0,"","","","","","LROI142","","","","","","","","","","",null,"LROI142",null,null,null,null,null,null,null,null,null,null,null,null,null,"LROI142"]
["Taluscomponent gereviseerd","talusRevised","Type operatie",0,"","","","","","","","LROI230","","","","","","","","",null,"LROI230",null,null,null,null,null,null,null,null,null,null,null,null,null,"LROI230"]
["Humeruscomponent gereviseerd","humerusRevised","Type operatie",0,"","","","","","","","","","LROI313","","LROI403","","","","",null,"LROI313","LROI403",null,null,null,null,null,null,null,null,null,null,null,null,"LROI313, LROI403"]
["Humeruskop/humerale liner gereviseerd","humeralHeadRevised","Type operatie",0,"","","","","","","","","","LROI314","","","","","","",null,"LROI314",null,null,null,null,null,null,null,null,null,null,null,null,null,"LROI314"]
["Glenoïdcup/glenosfeer gereviseerd","glenoidCupGlenosphereRevised","Type operatie",0,"","","","","","","","","","LROI315","","","","","","",null,"LROI315",null,null,null,null,null,null,null,null,null,null,null,null,null,"LROI315"]
["Metafyse/taper gereviseerd","metaphysisTaperRevised","Type operatie",0,"","","","","","","","","","LROI316","","","","","","",null,"LROI316",null,null,null,null,null,null,null,null,null,null,null,null,null,"LROI316"]
["Glenoïd liner/baseplate gereviseerd","glenoidLinerBaseplateRevised","Type operatie",0,"","","","","","","","","","LROI317","","","","","","",null,"LROI317",null,null,null,null,null,null,null,null,null,null,null,null,null,"LROI317"]
["Ulnacomponent gereviseerd","ulnaRevised","Type operatie",0,"","","","","","","","","","","","LROI404","","LROI494","","",null,"LROI404","LROI494",null,null,null,null,null,null,null,null,null,null,null,null,"LROI404, LROI494"]
["Radiuscomponent gereviseerd","radiusRevised","Type operatie",0,"","","","","","","","","","","","LROI405","","LROI493","","",null,"LROI405","LROI493",null,null,null,null,null,null,null,null,null,null,null,null,"LROI405, LROI493"]
["Ulnacomponent gereviseerd","ulnaRevised","Type operatie",0,"","","","","","","","","","","","LROI404","","LROI494","","",null,"LROI404","LROI494",null,null,null,null,null,null,null,null,null,null,null,null,"LROI404, LROI494"]
["Carpaalcomponent gereviseerd","carpalRevised ","Type operatie",0,"","","","","","","","","","","","","","LROI496","","",null,"LROI496",null,null,null,null,null,null,null,null,null,null,null,null,null,"LROI496"]
["Proximale component gereviseerd","proximalComponentRevised","Type operatie",0,"","","","","","","","","","","","","","","","LROI586",null,"LROI586",null,null,null,null,null,null,null,null,null,null,null,null,null,"LROI586"]
["Distale component gereviseerd","distalComponentRevised","Type operatie",0,"","","","","","","","","","","","","","","","LROI587",null,"LROI587",null,null,null,null,null,null,null,null,null,null,null,null,null,"LROI587"]
["Benadering","approach","Operatiekenmerken",0,"","","LROI046","","LROI145","","LROI234","","LROI318","","LROI406","LROI406","LROI500","","LROI591","",null,"LROI046","LROI145","LROI234","LROI318","LROI406","LROI500","LROI591",null,null,null,null,null,null,null,"LROI046, LROI145, LROI234, LROI318, LROI406, LROI500, LROI591"]
["Andere benadering, specificeer","approachOther","Operatiekenmerken ",0,"","","LROI047","","LROI146","","LROI235","","LROI319","","LROI407","LROI407","LROI501","","LROI592","",null,"LROI047","LROI146","LROI235","LROI319","LROI407","LROI501","LROI592",null,null,null,null,null,null,null,"LROI047, LROI146, LROI235, LROI319, LROI407, LROI501, LROI592"]
["(Correctie) osteotomie uitgevoerd","osteotomyPerformed","Operatiekenmerken ",0,"","","LROI048","","","","","","","","","","","","","",null,"LROI048",null,null,null,null,null,null,null,null,null,null,null,null,null,"LROI048"]
["Osteosynthese uitgevoerd","osteosynthesisPerformed","Operatiekenmerken ",0,"","","LROI049","","","","","","","","","","","","","",null,"LROI049",null,null,null,null,null,null,null,null,null,null,null,null,null,"LROI049"]
["Tuberositas osteotomie uitgevoerd","tuberositasOsteotomy","Operatiekenmerken ",0,"","","","","LROI147","","","",null,"","","","","","","",null,"LROI147","LROI320",null,null,null,null,null,null,null,null,null,null,null,null,"LROI147"]
["Mediale malleolus osteotomie uitgevoerd","medialMalleolarOsteotomy","Operatiekenmerken ",0,"","","","","","","LROI236","","","","","","","","","",null,"LROI236",null,null,null,null,null,null,null,null,null,null,null,null,null,"LROI236"]
["Achillespeesverlenging uitgevoerd","achillesTendonLengthening","Operatiekenmerken ",0,"","","","","","","LROI237","","","","","","","","","",null,"LROI237",null,null,null,null,null,null,null,null,null,null,null,null,null,"LROI237"]
["Ligament reconstructie uitgevoerd","ligamentReconstruction","Operatiekenmerken ",0,"","","","","","","LROI238","","","","","","","","LROI598","",null,"LROI238","LROI598",null,null,null,null,null,null,null,null,null,null,null,null,"LROI238, LROI598"]
["Osteotomie van het tuberculum minus uitgevoerd","tuberositasOsteotomy","Operatiekenmerken ",0,"","","","",null,"","","","LROI320","","","","","","","",null,"LROI147","LROI320",null,null,null,null,null,null,null,null,null,null,null,null,"LROI320"]
["Acromioplastiek uitgevoerd","acromioplasty","Operatiekenmerken ",0,"","","","","","","","","LROI321","","","","","","","",null,"LROI321",null,null,null,null,null,null,null,null,null,null,null,null,null,"LROI321"]
["Cuff reconstructie uitgevoerd","cuffReconstruction","Operatiekenmerken ",0,"","","","","","","","","LROI322","","","","","","","",null,"LROI322",null,null,null,null,null,null,null,null,null,null,null,null,null,"LROI322"]
["Distale clavicula resectie uitgevoerd","distalClavicleResection","Operatiekenmerken ",0,"","","","","","","","","LROI323","","","","","","","",null,"LROI323",null,null,null,null,null,null,null,null,null,null,null,null,null,"LROI323"]
["LCL losgemaakt","lclReleased","Operatiekenmerken ",0,"","","","","","","","","","","LROI408","LROI408","","","","",null,"LROI408",null,null,null,null,null,null,null,null,null,null,null,null,null,"LROI408"]
["Decompressie ulnaire zenuw","ulnarNerveRelease","Operatiekenmerken ",0,"","","","","","","","","","","LROI409","LROI409","","","","",null,"LROI409",null,null,null,null,null,null,null,null,null,null,null,null,null,"LROI409"]
["Transpositie ulnaire zenuw","ulnarNerveTransposition","Operatiekenmerken ",0,"","","","","","","","","","","LROI410","LROI410","","","","",null,"LROI410",null,null,null,null,null,null,null,null,null,null,null,null,null,"LROI410"]
["Weke delen stabilisatie","softTissuesStabilisation","Operatiekenmerken ",0,"","","","","","","","","","","","","LROI502","","LROI593","",null,"LROI502","LROI593",null,null,null,null,null,null,null,null,null,null,null,null,"LROI502, LROI593"]
["Andere weke delen stabilisatie, specificeer","softTissuesStabilisationOther","Operatiekenmerken ",0,"","","","","","","","","","","","","LROI503","","LROI594","",null,"LROI503","LROI594",null,null,null,null,null,null,null,null,null,null,null,null,"LROI503, LROI594"]
["Darrach procedure uitgevoerd","darrachProcedure","Operatiekenmerken ",0,"","","","","","","","","","","","","LROI504","","","",null,"LROI504",null,null,null,null,null,null,null,null,null,null,null,null,null,"LROI504"]
["Ulna osteotomie uitgevoerd","ulnaOsteotomy","Operatiekenmerken ",0,"","","","","","","","","","","","","LROI505","","","",null,"LROI505",null,null,null,null,null,null,null,null,null,null,null,null,null,"LROI505"]
["Proximale rij resectie uitgevoerd","proximalRowResection","Operatiekenmerken ",0,"","","","","","","","","","","","","LROI506","","","",null,"LROI506",null,null,null,null,null,null,null,null,null,null,null,null,null,"LROI506"]
["Andere botprocedure, specificeer","additionalBoneProceduresOther","Operatiekenmerken ",0,"","","","","","","","","","","","","LROI507","","","",null,"LROI507",null,null,null,null,null,null,null,null,null,null,null,null,null,"LROI507"]
["Patient Specific Instrumentation (PSI) gebruikt","psi","Operatiekenmerken ",0,"","","LROI050","LROI050","LROI151","LROI151","LROI240","LROI240","LROI324","LROI324","LROI411","LROI411","","","","",null,"LROI050","LROI151","LROI240","LROI324","LROI411",null,null,null,null,null,null,null,null,null,"LROI050, LROI151, LROI240, LROI324, LROI411"]
["Navigatie gebruikt","navigation","Operatiekenmerken ",0,"","","LROI051","LROI051","LROI152","LROI152","LROI241","LROI241","LROI325","LROI325","LROI412","LROI412","","","","",null,"LROI051","LROI152","LROI241","LROI325","LROI412",null,null,null,null,null,null,null,null,null,"LROI051, LROI152, LROI241, LROI325, LROI412"]
["Doorlichting gebruikt","screening","Operatiekenmerken ",0,"","","LROI052","LROI052","","","","","","","","","","","","",null,"LROI052",null,null,null,null,null,null,null,null,null,null,null,null,null,"LROI052"]
["Robotassistentie gebruikt","robotAssistance","Operatiekenmerken ",0,"","","LROI053","LROI053","LROI153","LROI153","LROI242","LROI242","LROI326","LROI326","LROI413","LROI413","","","","",null,"LROI053","LROI153","LROI242","LROI326","LROI413",null,null,null,null,null,null,null,null,null,"LROI053, LROI153, LROI242, LROI326, LROI413"]
["Botgraft gebruikt","bonegraft","Operatiekenmerken ",0,"","","LROI054","LROI054","LROI154","LROI154","LROI243","LROI243","LROI327","LROI327","LROI414","LROI414","LROI509","LROI509","LROI596","LROI596",null,"LROI054","LROI154","LROI243","LROI327","LROI414","LROI509","LROI596",null,null,null,null,null,null,null,"LROI054, LROI154, LROI243, LROI327, LROI414, LROI509, LROI596"]
["Patellectomie uitgevoerd","patellectomy","Operatiekenmerken ",0,"","","","","","LROI148","","","","","","","","","","",null,"LROI148",null,null,null,null,null,null,null,null,null,null,null,null,null,"LROI148"]
["Artrodese uitgevoerd","arthrodesisPerformed","Operatiekenmerken ",0,"","","","","","LROI149","","LROI239","","","","","","LROI508","","LROI595",null,"LROI149","LROI239","LROI508","LROI595",null,null,null,null,null,null,null,null,null,null,"LROI149, LROI239, LROI508, LROI595"]
["Onder bloedleegte uitgevoerd","surgicalTourniquet","Operatiekenmerken ",0,"","","","","LROI150","LROI150","","","","","","","","","","",null,"LROI150",null,null,null,null,null,null,null,null,null,null,null,null,null,"LROI150"]
["Voorgaande operaties","previousOperations","Voorgaande operaties ",0,"","","LROI055","","LROI155","","LROI244","","LROI328","","LROI415","","LROI510","","LROI597","",null,"LROI055","LROI155","LROI244","LROI328","LROI415","LROI510","LROI597",null,null,null,null,null,null,null,"LROI055, LROI155, LROI244, LROI328, LROI415, LROI510, LROI597"]
["Osteosynthese","osteosynthesis","Voorgaande operaties ",0,"","","LROI056","","LROI159","","LROI245","","LROI329","","LROI416","","","","","",null,"LROI056","LROI159","LROI245","LROI329","LROI416",null,null,null,null,null,null,null,null,null,"LROI056, LROI159, LROI245, LROI329, LROI416"]
["Osteotomie","osteotomy","Voorgaande operaties ",0,"","","LROI057","","LROI157","","LROI246","","","","","","","","","",null,"LROI057","LROI157","LROI246",null,null,null,null,null,null,null,null,null,null,null,"LROI057, LROI157, LROI246"]
["Artrodese","arthrodesis","Voorgaande operaties ",0,"","","LROI058","","","","LROI253","","","","","","","","LROI599","",null,"LROI058","LROI253","LROI599",null,null,null,null,null,null,null,null,null,null,null,"LROI058, LROI253, LROI599"]
["Girdlestone","girdlestone","Voorgaande operaties ",0,"","","LROI059","","","","","","","","","","","","","",null,"LROI059",null,null,null,null,null,null,null,null,null,null,null,null,null,"LROI059"]
["Artroscopie","arthroscopy","Voorgaande operaties ",0,"","","LROI060","","LROI161","","LROI248","","","","LROI420","","","","","",null,"LROI060","LROI161","LROI248","LROI420",null,null,null,null,null,null,null,null,null,null,"LROI060, LROI161, LROI248, LROI420"]
["Open meniscectomie","meniscectomy","Voorgaande operaties ",0,"","","","","LROI156","","","","","","","","","","","",null,"LROI156",null,null,null,null,null,null,null,null,null,null,null,null,null,"LROI156"]
["Voorste kruisband reconstructie","aclReconstruction","Voorgaande operaties ",0,"","","","","LROI158","","","","","","","","","","","",null,"LROI158",null,null,null,null,null,null,null,null,null,null,null,null,null,"LROI158"]
["Synovectomie","synovectomy","Voorgaande operaties ",0,"","","","","LROI160","","LROI247","","","","","","","","","",null,"LROI160","LROI247",null,null,null,null,null,null,null,null,null,null,null,null,"LROI160, LROI247"]
["Patella realignment procedure","patellaRealignment","Voorgaande operaties ",0,"","","","","LROI162","","","","","","","","","","","",null,"LROI162",null,null,null,null,null,null,null,null,null,null,null,null,null,"LROI162"]
["Knie distractie","kneeDistraction","Voorgaande operaties ",0,"","","","","LROI163","","","","","","","","","","","",null,"LROI163",null,null,null,null,null,null,null,null,null,null,null,null,null,"LROI163"]
["Behandeling osteochondraal botdefect","ocdTreatment","Voorgaande operaties ",0,"","","","","","","LROI249","","","","","","","","","",null,"LROI249",null,null,null,null,null,null,null,null,null,null,null,null,null,"LROI249"]
["Ligament reconstructie","previousOperationsLigamentReconstruction","Voorgaande operaties ",0,"","","","","","","LROI250","","","","","","","","","",null,"LROI250",null,null,null,null,null,null,null,null,null,null,null,null,null,"LROI250"]
["Achtervoetchirurgie","hindfootSurgery","Voorgaande operaties ",0,"","","","","","","LROI251","","","","","","","","","",null,"LROI251",null,null,null,null,null,null,null,null,null,null,null,null,null,"LROI251"]
["Voorvoetchirurgie","forefootSurgery","Voorgaande operaties ",0,"","","","","","","LROI252","","","","","","","","","",null,"LROI252",null,null,null,null,null,null,null,null,null,null,null,null,null,"LROI252"]
["Acromioplastiek","prevAcromioplasty","Voorgaande operaties ",0,"","","","","","","","","LROI330","","","","","","","",null,"LROI330",null,null,null,null,null,null,null,null,null,null,null,null,null,"LROI330"]
["Herstellen van de rotator cuff","rotatorCuffRepair","Voorgaande operaties ",0,"","","","","","","","","LROI331","","","","","","","",null,"LROI331",null,null,null,null,null,null,null,null,null,null,null,null,null,"LROI331"]
["Distale clavicula resectie","prevDistalClavicleResection","Voorgaande operaties ",0,"","","","","","","","","LROI332","","","","","","","",null,"LROI332",null,null,null,null,null,null,null,null,null,null,null,null,null,"LROI332"]
["Stabilisatieprocedure","stabilisationProcedure","Voorgaande operaties ",0,"","","","","","","","","LROI333","","","","","","","",null,"LROI333",null,null,null,null,null,null,null,null,null,null,null,null,null,"LROI333"]
["Tenotomie bicepspees","tenotomyBiceps","Voorgaande operaties ",0,"","","","","","","","","LROI334","","","","","","","",null,"LROI334",null,null,null,null,null,null,null,null,null,null,null,null,null,"LROI334"]
["Tenodesis bicepspees","tenodesisBiceps","Voorgaande operaties ",0,"","","","","","","","","LROI335","","","","","","","",null,"LROI335",null,null,null,null,null,null,null,null,null,null,null,null,null,"LROI335"]
["Laterale artrotomie","arthrotomyLateral","Voorgaande operaties ",0,"","","","","","","","","","","LROI417","","","","","",null,"LROI417",null,null,null,null,null,null,null,null,null,null,null,null,null,"LROI417"]
["Mediale artrotomie","arthrotomyMedial","Voorgaande operaties ",0,"","","","","","","","","","","LROI418","","","","","",null,"LROI418",null,null,null,null,null,null,null,null,null,null,null,null,null,"LROI418"]
["Posterieure artrotomie","arthrotomyPosterior","Voorgaande operaties ",0,"","","","","","","","","","","LROI419","","","","","",null,"LROI419",null,null,null,null,null,null,null,null,null,null,null,null,null,"LROI419"]
["Decompressie ulnaire zenuw","decompressionUlnarNerve","Voorgaande operaties ",0,"","","","","","","","","","","LROI421","","","","","",null,"LROI421",null,null,null,null,null,null,null,null,null,null,null,null,null,"LROI421"]
["Transpositie ulnaire zenuw","transpositionUlnarNerve","Voorgaande operaties ",0,"","","","","","","","","","","LROI422","","","","","",null,"LROI422",null,null,null,null,null,null,null,null,null,null,null,null,null,"LROI422"]
["Radiuskopresectie","radialHeadResection","Voorgaande operaties ",0,"","","","","","","","","","","","LROI423","","","","",null,"LROI401",null,null,null,null,null,null,null,null,null,null,null,null,null,"LROI423"]
["Plaat- of schroefverwijdering","plateScrewRemoval","Voorgaande operaties ",0,"","","","","","","","","","","LROI424","","","","","",null,"LROI424",null,null,null,null,null,null,null,null,null,null,null,null,null,"LROI424"]
["Osteosynthese radius","osteosynthesisRadius","Voorgaande operaties ",0,"","","","","","","","","","","","","LROI511","","","",null,"LROI511",null,null,null,null,null,null,null,null,null,null,null,null,null,"LROI511"]
["Osteosynthese ulna","osteosynthesisUlna","Voorgaande operaties ",0,"","","","","","","","","","","","","LROI512","","","",null,"LROI512",null,null,null,null,null,null,null,null,null,null,null,null,null,"LROI512"]
["Osteosynthese carpus","osteosynthesisCarpus","Voorgaande operaties ",0,"","","","","","","","","","","","","LROI513","","","",null,"LROI513",null,null,null,null,null,null,null,null,null,null,null,null,null,"LROI513"]
["Correctie osteotomie radius","correctionOsteotomyRadius","Voorgaande operaties ",0,"","","","","","","","","","","","","LROI514","","","",null,"LROI514",null,null,null,null,null,null,null,null,null,null,null,null,null,"LROI514"]
["Correction osteotomy ulna","correctionOsteotomyUlna","Voorgaande operaties ",0,"","","","","","","","","","","","","LROI515","","","",null,"LROI515",null,null,null,null,null,null,null,null,null,null,null,null,null,"LROI515"]
["Proximale rij resectie","proximalRowResectionPrev","Voorgaande operaties ",0,"","","","","","","","","","","","","LROI516","","","",null,"LROI516",null,null,null,null,null,null,null,null,null,null,null,null,null,"LROI516"]
["Totale artrodese","totalArthrodesis","Voorgaande operaties ",0,"","","","","","","","","","","","","LROI517","","","",null,"LROI517",null,null,null,null,null,null,null,null,null,null,null,null,null,"LROI517"]
["Partiële artrodese","partialArthrodesis","Voorgaande operaties ",0,"","","","","","","","","","","","","LROI518","","","",null,"LROI518",null,null,null,null,null,null,null,null,null,null,null,null,null,"LROI518"]
["Sauvé-Kapandji","sauveKapanji","Voorgaande operaties ",0,"","","","","","","","","","","","","LROI519","","","",null,"LROI519",null,null,null,null,null,null,null,null,null,null,null,null,null,"LROI519"]
["Ligamentaire reconstructie","ligamentaryReconstruction","Voorgaande operaties ",0,"","","","","","","","","","","","","LROI520","","","",null,"LROI520",null,null,null,null,null,null,null,null,null,null,null,null,null,"LROI520"]
["Interpositie plastiek","interpositionArthroplasty","Voorgaande operaties ",0,"","","","","","","","","","","","","","","LROI600","",null,"LROI600",null,null,null,null,null,null,null,null,null,null,null,null,null,"LROI600"]
["Osteosynthese intra-articulaire fractuur","osteosynthesisIntraArticularFracture","Voorgaande operaties ",0,"","","","","","","","","","","","","","","LROI601","",null,"LROI601",null,null,null,null,null,null,null,null,null,null,null,null,null,"LROI601"]
["Plaatsing spacer","placementSpacer","Voorgaande operaties ",0,"","","","","","","","","","","","","","","LROI602","",null,"LROI602",null,null,null,null,null,null,null,null,null,null,null,null,null,"LROI602"]
["Andere voorgaande operaties","previousOperationsOther","Voorgaande operaties ",0,"","","LROI061","","LROI164","","LROI254","","LROI336","","LROI425","","LROI521","","LROI603","",null,"LROI061","LROI164","LROI254","LROI336","LROI425","LROI521","LROI603",null,null,null,null,null,null,null,"LROI061, LROI164, LROI254, LROI336, LROI425, LROI521, LROI603"]
["Andere voorgaande operaties, specificeer","previousOperationsSpecify","Voorgaande operaties ",0,"","","LROI062","","LROI165","","LROI255","","LROI337","","LROI426","","LROI522","","LROI604","",null,"LROI062","LROI165","LROI255","LROI337","LROI426","LROI522","LROI604",null,null,null,null,null,null,null,"LROI062, LROI165, LROI255, LROI337, LROI426, LROI522, LROI604"]
["Fixatie","fixation","Cement",0,"","","LROI064","LROI064","LROI166","LROI166","LROI256","LROI256","LROI338","LROI338","LROI427","LROI427","LROI523","LROI523","LROI605","LROI605",null,"LROI064","LROI166","LROI256","LROI338","LROI427","LROI523","LROI605",null,null,null,null,null,null,null,"LROI064, LROI166, LROI256, LROI338, LROI427, LROI523, LROI605"]
["Lavage","lavage","Cement",0,"","","LROI065","LROI065","LROI167","LROI167","LROI257","LROI257","LROI339","LROI339","LROI428","LROI428","LROI524","LROI524","","",null,"LROI065","LROI167","LROI257","LROI339","LROI428","LROI524",null,null,null,null,null,null,null,null,"LROI065, LROI167, LROI257, LROI339, LROI428, LROI524"]
["Vacuum (mix)","vacuumMix","Cement",0,"","","LROI066","LROI066","LROI168","LROI168","","","LROI340","LROI340","LROI429","LROI429","LROI525","LROI525","","",null,"LROI066","LROI168","LROI340","LROI429","LROI525",null,null,null,null,null,null,null,null,null,"LROI066, LROI168, LROI340, LROI429, LROI525"]
["Pressurising","pressurising","Cement",0,"","","LROI067","LROI067","LROI169","LROI169","","","LROI341","LROI341","LROI430","LROI430","LROI526","LROI526","","",null,"LROI067","LROI169","LROI341","LROI430","LROI526",null,null,null,null,null,null,null,null,null,"LROI067, LROI169, LROI341, LROI430, LROI526"]
["Acetabulumcomponent gecementeerd","acetabulumCemented","Cement",0,"","","LROI068","LROI068","","","","","","","","","","","","",null,"LROI068",null,null,null,null,null,null,null,null,null,null,null,null,null,"LROI068"]
["Femurcomponent gecementeerd","femurCemented","Cement",0,"","","LROI069","LROI069","LROI170","LROI170","","","","","","","","","","",null,"LROI069","LROI170",null,null,null,null,null,null,null,null,null,null,null,null,"LROI069, LROI170"]
["Cement-in-cement","cementInCement","Cement",0,"","","","LROI063","","","","","","","","","","","","",null,"LROI063",null,null,null,null,null,null,null,null,null,null,null,null,null,"LROI063"]
["Tibiacomponent gecementeerd","tibiaCemented","Cement",0,"","","","","LROI171","LROI171","","","","","","","","","","",null,"LROI171",null,null,null,null,null,null,null,null,null,null,null,null,null,"LROI171"]
["Patellacomponent gecementeerd","patellaCemented","Cement",0,"","","","","LROI172","LROI172","","","","","","","","","","",null,"LROI172",null,null,null,null,null,null,null,null,null,null,null,null,null,"LROI172"]
["Humeruscomponent gecementeerd","humerusCemented","Cement",0,"","","","","","","","","LROI342","LROI342","LROI431","LROI431","","","","",null,"LROI342","LROI431",null,null,null,null,null,null,null,null,null,null,null,null,"LROI342, LROI431"]
["Glenoïdcomponent gecementeerd","glenoidCemented","Cement",0,"","","","","","","","","LROI343","LROI343","","","","","","",null,"LROI343",null,null,null,null,null,null,null,null,null,null,null,null,null,"LROI343"]
["Ulnacomponent gecementeerd","ulnaCemented","Cement",0,"","","","","","","","","","","LROI432","LROI432","LROI528","LROI528","","",null,"LROI432","LROI528",null,null,null,null,null,null,null,null,null,null,null,null,"LROI432, LROI528"]
["Radiuscomponent gecementeerd","radiusCemented","Cement",0,"","","","","","","","","","","LROI433","LROI433","LROI527","LROI527","","",null,"LROI433","LROI527",null,null,null,null,null,null,null,null,null,null,null,null,"LROI433, LROI527"]
["Carpaalcomponent gecementeerd","carpalCemented","Cement",0,"","","","","","","","","","","","","LROI529","LROI529","","",null,"LROI529",null,null,null,null,null,null,null,null,null,null,null,null,null,"LROI529"]
["Proximale component gecementeerd","proximalCemented","Cement",0,"","","","","","","","","","","","","","","LROI606","LROI606",null,"LROI606",null,null,null,null,null,null,null,null,null,null,null,null,null,"LROI606"]
["Distale component gecementeerd","distalCemented","Cement",0,"","","","","","","","","","","","","","","LROI607","LROI607",null,"LROI607",null,null,null,null,null,null,null,null,null,null,null,null,null,"LROI607"]
["Productnummer cement 1","productNumberCement","Componenten",0,"","","LROI070","LROI070","LROI173","LROI173","LROI258","LROI258","LROI344","LROI344","LROI434","LROI434","LROI530","LROI530","LROI608","LROI608",null,"LROI070","LROI173","LROI258","LROI344","LROI434","LROI530","LROI608",null,null,null,null,null,null,null,"LROI070, LROI173, LROI258, LROI344, LROI434, LROI530, LROI608"]
["Lotnummer cement 1","lotNumberCement","Componenten",0,"","","LROI071","LROI071","LROI174","LROI174","LROI259","LROI259","LROI345","LROI345","LROI435","LROI435","LROI531","LROI531","LROI609","LROI609",null,"LROI071","LROI174","LROI259","LROI345","LROI435","LROI531","LROI609",null,null,null,null,null,null,null,"LROI071, LROI174, LROI259, LROI345, LROI435, LROI531, LROI609"]
["Productnummer cement 2","productNumberCement","Componenten",0,"","","LROI072","LROI072","LROI175","LROI175","LROI260","LROI260","LROI346","LROI346","LROI436","LROI436","LROI532","LROI532","LROI610","LROI610",null,"LROI070","LROI173","LROI258","LROI344","LROI434","LROI530","LROI608",null,null,null,null,null,null,null,"LROI072, LROI175, LROI260, LROI346, LROI436, LROI532, LROI610"]
["Lotnummer cement 2","lotNumberCement","Componenten",0,"","","LROI073","LROI073","LROI176","LROI176","LROI261","LROI261","LROI347","LROI347","LROI437","LROI437","LROI533","LROI533","LROI611","LROI611",null,"LROI071","LROI174","LROI259","LROI345","LROI435","LROI531","LROI609",null,null,null,null,null,null,null,"LROI073, LROI176, LROI261, LROI347, LROI437, LROI533, LROI611"]
["Productnummer cement 3","productNumberCement","Componenten",0,"","","LROI074","LROI074","LROI177","LROI177","LROI262","LROI262","LROI348","LROI348","LROI438","LROI438","LROI534","LROI534","LROI612","LROI612",null,"LROI070","LROI173","LROI258","LROI344","LROI434","LROI530","LROI608",null,null,null,null,null,null,null,"LROI074, LROI177, LROI262, LROI348, LROI438, LROI534, LROI612"]
["Lotnummer cement 3","lotNumberCement","Componenten",0,"","","LROI075","LROI075","LROI178","LROI178","LROI263","LROI263","LROI349","LROI349","LROI439","LROI439","LROI535","LROI535","LROI613","LROI613",null,"LROI071","LROI174","LROI259","LROI345","LROI435","LROI531","LROI609",null,null,null,null,null,null,null,"LROI075, LROI178, LROI263, LROI349, LROI439, LROI535, LROI613"]
["Productnummer cement 4","productNumberCement","Componenten",0,"","","LROI076","LROI076","LROI179","LROI179","LROI264","LROI264","LROI350","LROI350","LROI440","LROI440","LROI536","LROI536","LROI614","LROI614",null,"LROI070","LROI173","LROI258","LROI344","LROI434","LROI530","LROI608",null,null,null,null,null,null,null,"LROI076, LROI179, LROI264, LROI350, LROI440, LROI536, LROI614"]
["Lotnummer cement 4","lotNumberCement","Componenten",0,"","","LROI077","LROI077","LROI180","LROI180","LROI265","LROI265","LROI351","LROI351","LROI441","LROI441","LROI537","LROI537","LROI615","LROI615",null,"LROI071","LROI174","LROI259","LROI345","LROI435","LROI531","LROI609",null,null,null,null,null,null,null,"LROI077, LROI180, LROI265, LROI351, LROI441, LROI537, LROI615"]
["Productnummer ","productNumberAcetabularComponent1","Componenten",0,"","","LROI078","LROI078","","","","","","","","","","","","",null,"LROI078",null,null,null,null,null,null,null,null,null,null,null,null,null,"LROI078"]
["Lot nummer ","lotNumberAcetabularComponent1","Componenten",0,"","","LROI079","LROI079","","","","","","","","","","","","",null,"LROI079",null,null,null,null,null,null,null,null,null,null,null,null,null,"LROI079"]
["Meer dan 1 acetabulumcomponent?","moreAcetabularComponents","Componenten",0,"","","LROI080","LROI080","","","","","","","","","","","","",null,"LROI080",null,null,null,null,null,null,null,null,null,null,null,null,null,"LROI080"]
["Productnummer ","productNumberAcetabularComponent2","Componenten",0,"","","LROI081","LROI081","","","","","","","","","","","","",null,"LROI081",null,null,null,null,null,null,null,null,null,null,null,null,null,"LROI081"]
["Lot nummer ","lotNumberAcetabularComponent2","Componenten",0,"","","LROI082","LROI082","","","","","","","","","","","","",null,"LROI082",null,null,null,null,null,null,null,null,null,null,null,null,null,"LROI082"]
["Productnummer ","productNumberInlay","Componenten",0,"","","LROI083","LROI083","LROI191","LROI191","","","","","","","","","","",null,"LROI083","LROI191",null,null,null,null,null,null,null,null,null,null,null,null,"LROI083, LROI191"]
["Lot nummer ","lotNumberInlay","Componenten",0,"","","LROI084","LROI084","LROI192","LROI192","","","","","","","","","","",null,"LROI084","LROI192",null,null,null,null,null,null,null,null,null,null,null,null,"LROI084, LROI192"]
["Productnummer ","productNumberFemoralComponent1","Componenten",0,"","","LROI085","LROI085","LROI181","LROI181","","","","","","","","","","",null,"LROI085","LROI181",null,null,null,null,null,null,null,null,null,null,null,null,"LROI085, LROI181"]
["Lot nummer ","lotNumberFemoralComponent1","Componenten",0,"","","LROI086","LROI086","LROI182","LROI182","","","","","","","","","","",null,"LROI086","LROI182",null,null,null,null,null,null,null,null,null,null,null,null,"LROI086, LROI182"]
["Meer dan 1 femurcomponent?","moreFemoralComponents","Componenten",0,"","","LROI087","LROI087","LROI183","LROI183","","","","","","","","","","",null,"LROI087","LROI183",null,null,null,null,null,null,null,null,null,null,null,null,"LROI087, LROI183"]
["Productnummer ","productNumberFemoralComponent2","Componenten",0,"","","LROI088","LROI088","LROI184","LROI184","","","","","","","","","","",null,"LROI088","LROI184",null,null,null,null,null,null,null,null,null,null,null,null,"LROI088, LROI184"]
["Lot nummer ","lotNumberFemoralComponent2","Componenten",0,"","","LROI089","LROI089","LROI185","LROI185","","","","","","","","","","",null,"LROI089","LROI185",null,null,null,null,null,null,null,null,null,null,null,null,"LROI089, LROI185"]
["Productnummer ","productNumberHead1","Componenten",0,"","","LROI090","LROI090","","","","","","","","","","","","",null,"LROI090",null,null,null,null,null,null,null,null,null,null,null,null,null,"LROI090"]
["Lot nummer ","lotNumberHead1","Componenten",0,"","","LROI091","LROI091","","","","","","","","","","","","",null,"LROI091",null,null,null,null,null,null,null,null,null,null,null,null,null,"LROI091"]
["Meer dan 1 femurkopcomponent?","moreHeads","Componenten",0,"","","LROI092","LROI092","","","","","","","","","","","","",null,"LROI092",null,null,null,null,null,null,null,null,null,null,null,null,null,"LROI092"]
["Productnummer ","productNumberHead2","Componenten",0,"","","LROI093","LROI093","","","","","","","","","","","","",null,"LROI093",null,null,null,null,null,null,null,null,null,null,null,null,null,"LROI093"]
["Lot nummer ","lotNumberHead2","Componenten",0,"","","LROI094","LROI094","","","","","","","","","","","","",null,"LROI094",null,null,null,null,null,null,null,null,null,null,null,null,null,"LROI094"]
["Meer dan 1 femoral component?","moreFemoralComponents","Componenten",0,"","","LROI087","LROI087","LROI183","LROI183","","","","","","","","","","",null,"LROI087","LROI183",null,null,null,null,null,null,null,null,null,null,null,null,"LROI087, LROI183"]
["Productnummer","productNumberTibiaComponent1","Componenten",0,"","","","","LROI186","LROI186","","","","","","","","","","",null,"LROI186",null,null,null,null,null,null,null,null,null,null,null,null,null,"LROI186"]
["Lot nummer","lotNumberTibiaComponent1","Componenten",0,"","","","","LROI187","LROI187","","","","","","","","","","",null,"LROI187",null,null,null,null,null,null,null,null,null,null,null,null,null,"LROI187"]
["Meer dan 1 tibia component?","moreTibiaComponents","Componenten",0,"","","","","LROI188","LROI188","","","","","","","","","","",null,"LROI188",null,null,null,null,null,null,null,null,null,null,null,null,null,"LROI188"]
["Productnummer","productNumberTibiaComponent2","Componenten",0,"","","","","LROI189","LROI189","","","","","","","","","","",null,"LROI189",null,null,null,null,null,null,null,null,null,null,null,null,null,"LROI189"]
["Lot nummer","lotNumberTibiaComponent2","Componenten",0,"","","","","LROI190","LROI190","","","","","","","","","","",null,"LROI190",null,null,null,null,null,null,null,null,null,null,null,null,null,"LROI190"]
["Productnummer","productNumberPatellaComponent","Componenten",0,"","","","","LROI193","LROI193","","","","","","","","","","",null,"LROI193",null,null,null,null,null,null,null,null,null,null,null,null,null,"LROI193"]
["Lot nummer","lotNumberPatellaComponent","Componenten",0,"","","","","LROI194","LROI194","","","","","","","","","","",null,"LROI194",null,null,null,null,null,null,null,null,null,null,null,null,null,"LROI194"]
["Productnummer 1","productNumberTibialComponent","Componenten",0,"","","","","","","LROI266","LROI266","","","","","","","","",null,"LROI266",null,null,null,null,null,null,null,null,null,null,null,null,null,"LROI266"]
["Lot nummer 1","lotNumberTibialComponent","Componenten",0,"","","","","","","LROI267","LROI267","","","","","","","","",null,"LROI267",null,null,null,null,null,null,null,null,null,null,null,null,null,"LROI267"]
["Productnummer 2","productNumberTalusComponent","Componenten",0,"","","","","","","LROI268","LROI268","","","","","","","","",null,"LROI268",null,null,null,null,null,null,null,null,null,null,null,null,null,"LROI268"]
["Lot nummer 2","lotNumberTalusComponent","Componenten",0,"","","","","","","LROI269","LROI269","","","","","","","","",null,"LROI269",null,null,null,null,null,null,null,null,null,null,null,null,null,"LROI269"]
["Productnummer 3","productNumberInlayComponent","Componenten",0,"","","","","","","LROI270","LROI270","","","","","LROI546","LROI546","","",null,"LROI270","LROI546",null,null,null,null,null,null,null,null,null,null,null,null,"LROI270, LROI546"]
["Lot nummer 3","lotNumberInlayComponent","Componenten",0,"","","","","","","LROI271","LROI271","","","","","LROI547","LROI547","","",null,"LROI271","LROI547",null,null,null,null,null,null,null,null,null,null,null,null,"LROI271, LROI547"]
["Productnummer ","productNumberHumeralComponent","Componenten",0,"","","","","","","","","LROI352","LROI352","","","","","","",null,"LROI352",null,null,null,null,null,null,null,null,null,null,null,null,null,"LROI352"]
["Lot nummer ","lotNumberHumeralComponent","Componenten",0,"","","","","","","","","LROI353","LROI353","","","","","","",null,"LROI353",null,null,null,null,null,null,null,null,null,null,null,null,null,"LROI353"]
["Productnummer ","productNumberHumeralHead","Componenten",0,"","","","","","","","","LROI354","LROI354","","","","","","",null,"LROI354",null,null,null,null,null,null,null,null,null,null,null,null,null,"LROI354"]
["Lot nummer ","lotNumberHumeralHead","Componenten",0,"","","","","","","","","LROI355","LROI355","","","","","","",null,"LROI355",null,null,null,null,null,null,null,null,null,null,null,null,null,"LROI355"]
["Productnummer ","productNumberGlenoidCup","Componenten",0,"","","","","","","","","LROI356","LROI356","","","","","","",null,"LROI356",null,null,null,null,null,null,null,null,null,null,null,null,null,"LROI356"]
["Lot nummer ","lotNumberGlenoidCup","Componenten",0,"","","","","","","","","LROI357","LROI357","","","","","","",null,"LROI357",null,null,null,null,null,null,null,null,null,null,null,null,null,"LROI357"]
["Productnummer ","productNumberMetaphysealComponent","Componenten",0,"","","","","","","","","LROI358","LROI358","","","","","","",null,"LROI358",null,null,null,null,null,null,null,null,null,null,null,null,null,"LROI358"]
["Lot nummer ","lotNumberMetaphysealComponent","Componenten",0,"","","","","","","","","LROI359","LROI359","","","","","","",null,"LROI359",null,null,null,null,null,null,null,null,null,null,null,null,null,"LROI359"]
["Productnummer ","productNumberGlenoidLiner","Componenten",0,"","","","","","","","","LROI360","LROI360","","","","","","",null,"LROI360",null,null,null,null,null,null,null,null,null,null,null,null,null,"LROI360"]
["Lot nummer ","lotNumberGlenoidLiner","Componenten",0,"","","","","","","","","LROI361","LROI361","","","","","","",null,"LROI361",null,null,null,null,null,null,null,null,null,null,null,null,null,"LROI361"]
["Productnummer ","productNumberHumeralComponent1","Componenten",0,"","","","","","","","","","","LROI442","LROI442","","","","",null,"LROI442",null,null,null,null,null,null,null,null,null,null,null,null,null,"LROI442"]
["Lot nummer ","lotNumberHumeralComponent1","Componenten",0,"","","","","","","","","","","LROI443","LROI443","","","","",null,"LROI443",null,null,null,null,null,null,null,null,null,null,null,null,null,"LROI443"]
["Meer dan 1 humerus component?","moreHumeralComponents","Componenten",0,"","","","","","","","","","","LROI444","LROI444","","","","",null,"LROI444",null,null,null,null,null,null,null,null,null,null,null,null,null,"LROI444"]
["Productnummer ","productNumberHumeralComponent2","Componenten",0,"","","","","","","","","","","LROI445","LROI445","","","","",null,"LROI445",null,null,null,null,null,null,null,null,null,null,null,null,null,"LROI445"]
["Lot nummer ","lotNumberHumeralComponent2","Componenten",0,"","","","","","","","","","","LROI446","LROI446","","","","",null,"LROI446",null,null,null,null,null,null,null,null,null,null,null,null,null,"LROI446"]
["Productnummer ","productNumberUlnarComponent1","Componenten",0,"","","","","","","","","","","LROI447","LROI447","","","","",null,"LROI447",null,null,null,null,null,null,null,null,null,null,null,null,null,"LROI447"]
["Lot nummer ","lotNumberUlnarComponent1","Componenten",0,"","","","","","","","","","","LROI448","LROI448","","","","",null,"LROI448",null,null,null,null,null,null,null,null,null,null,null,null,null,"LROI448"]
["Meer dan 1 ulna component?","moreUlnaComponents","Componenten",0,"","","","","","","","","","","LROI449","LROI449","","","","",null,"LROI449",null,null,null,null,null,null,null,null,null,null,null,null,null,"LROI449"]
["Productnummer ","productNumberUlnarComponent2","Componenten",0,"","","","","","","","","","","LROI450","LROI450","","","","",null,"LROI450",null,null,null,null,null,null,null,null,null,null,null,null,null,"LROI450"]
["Lot nummer ","lotNumberUlnarComponent2","Componenten",0,"","","","","","","","","","","LROI451","LROI451","","","","",null,"LROI451",null,null,null,null,null,null,null,null,null,null,null,null,null,"LROI451"]
["Productnummer ","productNumberRadialHeadComponent","Componenten",0,"","","","","","","","","","","LROI452","LROI452","LROI538","LROI538","","",null,"LROI452","LROI538",null,null,null,null,null,null,null,null,null,null,null,null,"LROI452, LROI538"]
["Lot nummer ","lotNumberRadialHeadComponent","Componenten",0,"","","","","","","","","","","LROI453","LROI453","LROI539","LROI539","","",null,"LROI453","LROI539",null,null,null,null,null,null,null,null,null,null,null,null,"LROI453, LROI539"]
["Productnummer ","productNumberRadialStemComponent","Componenten",0,"","","","","","","","","","","LROI454","LROI454","LROI540","LROI540","","",null,"LROI454","LROI540",null,null,null,null,null,null,null,null,null,null,null,null,"LROI454, LROI540"]
["Lot nummer ","lotNumberRadialStemComponent","Componenten",0,"","","","","","","","","","","LROI455","LROI455","LROI541","LROI541","","",null,"LROI455","LROI541",null,null,null,null,null,null,null,null,null,null,null,null,"LROI455, LROI541"]
["Productnummer ","productNumberUlnarStemComponent","Componenten",0,"","","","","","","","","","","","","LROI542","LROI542","","",null,"LROI542",null,null,null,null,null,null,null,null,null,null,null,null,null,"LROI542"]
["Lot nummer ","lotNumberUlnarStemComponent","Componenten",0,"","","","","","","","","","","","","LROI543","LROI543","","",null,"LROI543",null,null,null,null,null,null,null,null,null,null,null,null,null,"LROI543"]
["Productnummer ","productNumberUlnarHeadComponent","Componenten",0,"","","","","","","","","","","","","LROI544","LROI544","","",null,"LROI544",null,null,null,null,null,null,null,null,null,null,null,null,null,"LROI544"]
["Lot nummer ","lotNumberUlnarHeadComponent","Componenten",0,"","","","","","","","","","","","","LROI545","LROI545","","",null,"LROI545",null,null,null,null,null,null,null,null,null,null,null,null,null,"LROI545"]
["Productnummer ","productNumberInlayComponent","Componenten",0,"","","","","","","LROI270","LROI270","","","","","LROI546","LROI546","","",null,"LROI270","LROI546",null,null,null,null,null,null,null,null,null,null,null,null,"LROI270, LROI546"]
["Lot nummer ","lotNumberInlayComponent","Componenten",0,"","","","","","","LROI271","LROI271","","","","","LROI547","LROI547","","",null,"LROI271","LROI547",null,null,null,null,null,null,null,null,null,null,null,null,"LROI271, LROI547"]
["Productnummer ","productNumberCarpalComponent1","Componenten",0,"","","","","","","","","","","","","LROI548","LROI548","","",null,"LROI548",null,null,null,null,null,null,null,null,null,null,null,null,null,"LROI548"]
["Lot nummer ","lotNumberCarpalComponent1","Componenten",0,"","","","","","","","","","","","","LROI549","LROI549","","",null,"LROI549",null,null,null,null,null,null,null,null,null,null,null,null,null,"LROI549"]
["Productnummer ","productNumberCarpalComponent2","Componenten",0,"","","","","","","","","","","","","LROI550","LROI550","","",null,"LROI550",null,null,null,null,null,null,null,null,null,null,null,null,null,"LROI550"]
["Lot nummer ","lotNumberCarpalComponent2","Componenten",0,"","","","","","","","","","","","","LROI551","LROI551","","",null,"LROI551",null,null,null,null,null,null,null,null,null,null,null,null,null,"LROI551"]
["Productnummer ","productNumberCarpalComponent3","Componenten",0,"","","","","","","","","","","","","LROI552","LROI552","","",null,"LROI552",null,null,null,null,null,null,null,null,null,null,null,null,null,"LROI552"]
["Lot nummer ","lotNumberCarpalComponent3","Componenten",0,"",null,null,null,null,null,null,null,null,null,null,null,"LROI553","LROI553",null,null,null,null,null,null,null,null,null,null,null,null,null,null,null,null,null,"LROI553"]
["Productnummer ","productNumberProximalStemComponent","Componenten",0,"","","","","","","","","","","","","","","LROI616","LROI616",null,"LROI616",null,null,null,null,null,null,null,null,null,null,null,null,null,"LROI616"]
["Lot nummer ","lotNumberProximalStemComponent","Componenten",0,"","","","","","","","","","","","","","","LROI617","LROI617",null,"LROI617",null,null,null,null,null,null,null,null,null,null,null,null,null,"LROI617"]
["Productnummer ","productNumberProximalHeadComponent","Componenten",0,"","","","","","","","","","","","","","","LROI618","LROI618",null,"LROI618",null,null,null,null,null,null,null,null,null,null,null,null,null,"LROI618"]
["Lot nummer ","lotNumberProximalHeadComponent","Componenten",0,"","","","","","","","","","","","","","","LROI619","LROI619",null,"LROI619",null,null,null,null,null,null,null,null,null,null,null,null,null,"LROI619"]
["Productnummer ","productNumberDistalStemComponent","Componenten",0,"","","","","","","","","","","","","","","LROI620","LROI620",null,"LROI620",null,null,null,null,null,null,null,null,null,null,null,null,null,"LROI620"]
["Lot nummer ","lotNumberDistalStemComponent","Componenten",0,"","","","","","","","","","","","","","","LROI621","LROI621",null,"LROI621",null,null,null,null,null,null,null,null,null,null,null,null,null,"LROI621"]
["Productnummer ","productNumberDistalHeadComponent","Componenten",0,"","","","","","","","","","","","","","","LROI622","LROI622",null,"LROI622",null,null,null,null,null,null,null,null,null,null,null,null,null,"LROI622"]
["Lot nummer ","lotNumberDistalHeadComponent","Componenten",0,"","","","","","","","","","","","","","","LROI623","LROI623",null,"LROI623",null,null,null,null,null,null,null,null,null,null,null,null,null,"LROI623"]
["Productnummer","code","Componenten",0,"","","LROI095","LROI095","LROI195","LROI195","LROI272","LROI272","LROI362","LROI362","LROI456","LROI456","LROI554","LROI554","LROI624","LROI624",null,"LROI095","LROI195","LROI272","LROI362","LROI456","LROI554","LROI624",null,null,null,null,null,null,null,"LROI095, LROI195, LROI272, LROI362, LROI456, LROI554, LROI624"]
["Lot nummer","lotNumber","Componenten",0,"","","LROI096","LROI096","LROI196","LROI196","LROI273","LROI273","LROI363","LROI363","LROI457","LROI457","LROI555","LROI555","LROI625","LROI625",null,"LROI096","LROI196","LROI273","LROI363","LROI457","LROI555","LROI625",null,null,null,null,null,null,null,"LROI096, LROI196, LROI273, LROI363, LROI457, LROI555, LROI625"]
[]
[]
[]
[]
[]
[]
[]
[]
[]
[]
[]
[]
[]
[]
[]
[]
[]
[]
[]
[]
[]
[]
[null,null,null,null,null,null,null,null,null,null,null,null,null,null,null,null,null,null,null,null,null,null,null,null,null,null,null,null,null,null,null,null,null,null,null,0]

{"sheet":"Ziekenhuispatiëntnummer","index":5,"n_rows":23,"n_cols":2,"rows_kept":23,"cut":false,"hidden":false,"merged":[]}
["DATA_ID",{"$f":"INDEX(Overzicht_unique!$A:$AJ, MATCH($B$2,Overzicht_unique!$A:$A,0), 36)","v":"LROI002"}]
["LROI uitvraag","Ziekenhuispatiëntnummer"]
["Variabelenaam XML","patientnumber"]
["Variabelenaam database","patientnumber"]
["Label EN","Unique patient number in current hospital "]
["Label NL","Ziekenhuispatiëntnummer "]
["Definitie","Ziekenhuispatiëntnummer in ziekenhuisinformatiesysteem (ZIS)"]
["Doel / reden uitvraag","Identificatie en traceerbaarheid van de patiënt"]
["Waarde verplicht","Technisch verplicht"]
["Datatype","Tekst (TXT)"]
["Domein (acceptabele range, min-max)"]
["Eenheid"]
["Format (max. lengte)",16]
["Decimalen"]
["Codering"]
["Periode","Sinds start registratie"]
["Wijziging (datum en reden)"]
["Noodzakelijk voor kwaliteitsindicatoren","Ja"]
["Opmerkingen","De combinatie van de zorgaanbieder (LROI ziekenhuisnummer) en de patiënt (ziekenhuispatiëntnummer) is uniek"]
["Zorg Informatie Bouwsteen (ZIB)","ZIB: Patient\nContainer (1): \nContainer (2):\nDataelement: Identificatienummer\nOmzetting naar LROI: "]
["Voorbeeld","<patientnumber>123456789</patientnumber>"]
[]
["Terug naar Overzicht"]

{"sheet":"Burger Service Nummer","index":6,"n_rows":23,"n_cols":2,"rows_kept":23,"cut":false,"hidden":false,"merged":[]}
["DATA_ID",{"$f":"INDEX(Overzicht_unique!$A:$AJ, MATCH($B$2,Overzicht_unique!$A:$A,0), 36)","v":"LROI003"}]
["LROI uitvraag","Burger Service Nummer "]
["Variabelenaam XML","bsn"]
["Variabelenaam database","bsn"]
["Label EN","BSN "]
["Label NL","Burger Service Nummer "]
["Definitie","Het burgerservicenummer (BSN) is een uniek persoonsnummer voor iedereen die ingeschreven staat in de Basisregistratie Personen (BRP) in Nederland. "]
["Doel / reden uitvraag","Identificatie en traceerbaarheid van de patiënt; Kwaliteitsindicator 5b.Volledigheid registratie LROI. Volledig operatie-record: Ingrepen waarbij alle items die nodig zijn voor het berekenen van de externe indicatoren ingevuld zijn. Hieronder vallen: geslacht, geëncrypteerd BSN, geboortedatum, diagnose, ASA score, BMI, Charnley score, roken, datum van operatie, kant van operatie, type prothese, benadering, fixatie en soort prothese."]
["Waarde verplicht","Functioneel verplicht; maakt koppeling mogelijk van ingrepen op patiëntniveau van patiënten die meerdere operaties hebben ondergaan in verschillende zorginstellingen"]
["Datatype","Tekst (TXT)"]
["Domein (acceptabele range, min-max)","9 cijfers"]
["Eenheid"]
["Format (max. lengte)",250]
["Decimalen"]
["Codering","Geëncrypteerde waarde"]
["Periode","Encryptie van het BSN is mogelijk sinds 2013"]
["Wijziging (datum en reden)"]
["Noodzakelijk voor kwaliteitsindicatoren","Ja"]
["Opmerkingen","Versleuteling door ZorgTTP: het BSN wordt direct geëncrypteerd via de module TRES van ZorgTTP. Via de geëncrypteerde BSN’s zijn primaire- en revisie ingrepen aan elkaar te koppelen, ook als de revisie-ingreep bij een andere zorgaanbieder heeft plaatsgevonden. "]
["Zorg Informatie Bouwsteen (ZIB)","ZIB: Patient\nContainer (1):\nContainer (2):\nDataelement: Identificatienummer\nOmzetting naar LROI:"]
["Voorbeeld","<bsn>3::80c379d1-a257-4908-82c4-61ced4df85b4::1:V5yLWvPjz+wVQN8FssqYxQ==::1:SyJQFNYBwILCfpZwx2wOI6Qp5SQT1DP7CqMOaWcsoHwinni+mrp849YJJ9w6eOq1::4DQUYrDb2gKG5niUL/ax+Bv9+ufOAI5sUzQCO5Noufw=</bsn>"]
[]
["Terug naar Overzicht"]

{"sheet":"Geslacht","index":7,"n_rows":23,"n_cols":2,"rows_kept":23,"cut":false,"hidden":false,"merged":[]}
["DATA_ID",{"$f":"INDEX(Overzicht_unique!$A:$AJ, MATCH($B$2,Overzicht_unique!$A:$A,0), 36)","v":"LROI004"}]
["LROI uitvraag","Geslacht"]
["Variabelenaam XML","gender"]
["Variabelenaam database","gender"]
["Label EN","Gender "]
["Label NL","Geslacht "]
["Definitie","Geslacht van de patiënt"]
["Doel / reden uitvraag","Inzicht in patiëntkenmerken; Casemixcorrectie; Kwaliteitsindicator 5b.Volledigheid registratie LROI. Volledig operatie-record: Ingrepen waarbij alle items die nodig zijn voor het berekenen van de externe indicatoren ingevuld zijn. Hieronder vallen: geslacht, geëncrypteerd BSN, geboortedatum, diagnose, ASA score, BMI, Charnley score, roken, datum van operatie, kant van operatie, type prothese, benadering, fixatie en soort prothese."]
["Waarde verplicht","Technisch verplicht"]
["Datatype","Integer (INT)"]
["Domein (acceptabele range, min-max)"]
["Eenheid"]
["Format (max. lengte)"]
["Decimalen"]
["Codering","0= Male (EN)/ Man (NL)\n1= Female (EN)/ Vrouw (NL)\n2= Undifferentiated (EN)/ Ongedifferentieerd (NL)\n3= Unknown (EN)/ Onbekend (NL)"]
["Periode","Sinds start registratie"]
["Wijziging (datum en reden)","Coderingen 2 en 3 toegevoegd sinds 01-01-2022 (LROI-ingrepen v5.1)"]
["Noodzakelijk voor kwaliteitsindicatoren","Ja"]
["Opmerkingen"]
["Zorg Informatie Bouwsteen (ZIB)","ZIB: Patient\nContainer (1):\nContainer (2):\nDataelement: Geslacht\nOmzetting naar LROI:"]
["Voorbeeld","<gender>0</gender>"]
[]
["Terug naar Overzicht"]

{"sheet":"Geboortedatum","index":8,"n_rows":23,"n_cols":2,"rows_kept":23,"cut":false,"hidden":false,"merged":[]}
["DATA_ID",{"$f":"INDEX(Overzicht_unique!$A:$AJ, MATCH($B$2,Overzicht_unique!$A:$A,0), 36)","v":"LROI005"}]
["LROI uitvraag","Geboortedatum"]
["Variabelenaam XML","birthdate"]
["Variabelenaam database","birthdate"]
["Label EN","Birthdate"]
["Label NL","Geboortedatum "]
["Definitie","Geboortedatum van de patiënt"]
["Doel / reden uitvraag","Bepalen van leeftijd tijdens operatie, o.a. voor casemixcorrectie; Kwaliteitsindicator 5b.Volledigheid registratie LROI. Volledig operatie-record: Ingrepen waarbij alle items die nodig zijn voor het berekenen van de externe indicatoren ingevuld zijn. Hieronder vallen: geslacht, geëncrypteerd BSN, geboortedatum, diagnose, ASA score, BMI, Charnley score, roken, datum van operatie, kant van operatie, type prothese, benadering, fixatie en soort prothese."]
["Waarde verplicht","Technisch verplicht"]
["Datatype","Datum (DATE)"]
["Domein (acceptabele range, min-max)"]
["Eenheid"]
["Format (max. lengte)","jjjj-mm-dd"]
["Decimalen"]
["Codering"]
["Periode","Sinds start registratie"]
["Wijziging (datum en reden)"]
["Noodzakelijk voor kwaliteitsindicatoren","Ja"]
["Opmerkingen"]
["Zorg Informatie Bouwsteen (ZIB)","ZIB: Patient\nContainer (1):\nContainer (2):\nDataelement: Geboortedatum\nOmzetting naar LROI:"]
["Voorbeeld","<birthdate>1961-12-19</birthdate>"]
[]
["Terug naar Overzicht"]

{"sheet":"Overlijdensdatum","index":9,"n_rows":23,"n_cols":2,"rows_kept":23,"cut":false,"hidden":false,"merged":[]}
["DATA_ID",{"$f":"INDEX(Overzicht_unique!$A:$AJ, MATCH($B$2,Overzicht_unique!$A:$A,0), 36)","v":"LROI006"}]
["LROI uitvraag","Overlijdensdatum"]
["Variabelenaam XML","deathdate"]
["Variabelenaam database","deathdate"]
["Label EN","Deathdate "]
["Label NL","Overlijdensdatum "]
["Definitie","Indien patiënt overleden, de datum van overlijden"]
["Doel / reden uitvraag","Uitkomstinformatie/ einde follow-up van de patiënt"]
["Waarde verplicht","Indien van toepassing functioneel verplicht"]
["Datatype","Datum (DATE)"]
["Domein (acceptabele range, min-max)"]
["Eenheid"]
["Format (max. lengte)","jjjj-mm-dd"]
["Decimalen"]
["Codering"]
["Periode","Sinds start registratie"]
["Wijziging (datum en reden)"]
["Noodzakelijk voor kwaliteitsindicatoren","Nee"]
["Opmerkingen","Aan de LROI worden overlijdensdata gekoppeld zoals opgenomen in de database van Vektis, met daarin alle declaratiedata in de zorg. Deze koppeling vindt plaats door de encryptieservice TRES van ZorgTTP. "]
["Zorg Informatie Bouwsteen (ZIB)","ZIB: Patient\nContainer (1):\nContainer (2):\nDataelement: DatumOverlijden\nOmzetting naar LROI:"]
["Voorbeeld","<deathdate/>"]
[]
["Terug naar Overzicht"]

{"sheet":"Ziekenhuisnummer","index":10,"n_rows":23,"n_cols":2,"rows_kept":23,"cut":false,"hidden":false,"merged":[]}
["DATA_ID",{"$f":"INDEX(Overzicht_unique!$A:$AJ, MATCH($B$2,Overzicht_unique!$A:$A,0), 36)","v":"LROI007"}]
["LROI uitvraag","Ziekenhuisnummer"]
["Variabelenaam XML","hospitalId"]
["Variabelenaam database","hospital_id"]
["Label EN","hospitalID"]
["Label NL","Ziekenhuisnummer "]
["Definitie","Nummer van aanleverend zorgaanbieder"]
["Doel / reden uitvraag","Door LROI toegekend nummer aan de zorgaanbieder, wordt o.a. gebruikt voor Row-level security (RLS) in data-uitwisseling/-terugkoppeling via Dashboard en data(kwaliteits)rapporten "]
["Waarde verplicht","Automatische aanlevering vanuit formulierkeuze"]
["Datatype","Integer (INT)"]
["Domein (acceptabele range, min-max)"]
["Eenheid"]
["Format (max. lengte)"]
["Decimalen"]
["Codering","4 cijferig"]
["Periode","Sinds start registratie"]
["Wijziging (datum en reden)"]
["Noodzakelijk voor kwaliteitsindicatoren","Ja"]
["Opmerkingen","Door LROI toegekend nummer van de zorgaanbieder"]
["Zorg Informatie Bouwsteen (ZIB)","ZIB: Zorgaanbieder\nContainer (1):\nContainer (2):\nDataelement: ZorgaanbiederIdentificatienummer\nOmzetting naar LROI:"]
["Voorbeeld","<hospitalId>3340</hospitalId>"]
[]
["Terug naar Overzicht"]

{"sheet":"Operatietype","index":11,"n_rows":23,"n_cols":2,"rows_kept":23,"cut":false,"hidden":false,"merged":[]}
["DATA_ID",{"$f":"INDEX(Overzicht_unique!$A:$AJ, MATCH($B$2,Overzicht_unique!$A:$A,0), 36)","v":"LROI008, LROI097, LROI197, LROI274, LROI364, LROI458, LROI556"}]
["LROI uitvraag","Operatietype"]
["Variabelenaam XML","procedureType"]
["Variabelenaam database","Procedure_type"]
["Label EN","Operation type "]
["Label NL","Operatietype "]
["Definitie","Type operatie: primair of revisie-ingreep. Primaire ingreep: eerste plaatsing van prothese ter vervanging van het gewricht. Revisie-ingreep: elke verandering (plaatsing, vervanging, verwijdering of toevoeging) van één of meerdere componenten van de gewrichtsprothese."]
["Doel / reden uitvraag","Inzicht in kwaliteit; Kwaliteitsindicator 5b.Volledigheid registratie LROI. Volledig operatie-record: Ingrepen waarbij alle items die nodig zijn voor het berekenen van de externe indicatoren ingevuld zijn. Hieronder vallen: geslacht, geëncrypteerd BSN, geboortedatum, diagnose, ASA score, BMI, Charnley score, roken, datum van operatie, kant van operatie, type prothese, benadering, fixatie en soort prothese."]
["Waarde verplicht","Technisch verplicht; Automatisch vanuit formulierkeuze primair of revisie"]
["Datatype","Integer (INT)"]
["Domein (acceptabele range, min-max)"]
["Eenheid"]
["Format (max. lengte)"]
["Decimalen"]
["Codering","1= Primary (EN)/ Primair (NL)\n2= Revision (EN)/ Revisie (NL)"]
["Periode","Sinds start registratie"]
["Wijziging (datum en reden)"]
["Noodzakelijk voor kwaliteitsindicatoren","Ja"]
["Opmerkingen","Vanuit formulierkeuze primair of revisie"]
["Zorg Informatie Bouwsteen (ZIB)","ZIB: Verrichting\nContainer (1):\nContainer (2):\nDataelement: VerrichtingType\nOmzetting naar LROI:"]
["Voorbeeld","<procedureType>1</procedureType>"]
[]
["Terug naar Overzicht"]

{"sheet":"Operatiedatum","index":12,"n_rows":23,"n_cols":2,"rows_kept":23,"cut":false,"hidden":false,"merged":[]}
["DATA_ID",{"$f":"INDEX(Overzicht_unique!$A:$AJ, MATCH($B$2,Overzicht_unique!$A:$A,0), 36)","v":"LROI009, LROI098, LROI198, LROI275, LROI365, LROI459, LROI557"}]
["LROI uitvraag","Operatiedatum"]
["Variabelenaam XML","procedureDate"]
["Variabelenaam database","procedure_date"]
["Label EN","Procedure Date"]
["Label NL","Operatiedatum"]
["Definitie","Datum waarop de operatie heeft plaatsgevonden. "]
["Doel / reden uitvraag","Inzicht in kwaliteit; startdatum follow-up; Kwaliteitsindicator 5b.Volledigheid registratie LROI. Volledig operatie-record: Ingrepen waarbij alle items die nodig zijn voor het berekenen van de externe indicatoren ingevuld zijn. Hieronder vallen: geslacht, geëncrypteerd BSN, geboortedatum, diagnose, ASA score, BMI, Charnley score, roken, datum van operatie, kant van operatie, type prothese, benadering, fixatie en soort prothese."]
["Waarde verplicht","Technisch verplicht"]
["Datatype","Datum (DATE)"]
["Domein (acceptabele range, min-max)"]
["Eenheid"]
["Format (max. lengte)","dd-mm-jjjj"]
["Decimalen"]
["Codering"]
["Periode","Sinds start registratie"]
["Wijziging (datum en reden)"]
["Noodzakelijk voor kwaliteitsindicatoren","Ja"]
["Opmerkingen"]
["Zorg Informatie Bouwsteen (ZIB)","ZIB: Verrichting\nContainer (1):\nContainer (2):\nDataelement: VerrichtingStartDatum\nOmzetting naar LROI:"]
["Voorbeeld","<procedureDate>2022-08-18</procedureDate>"]
[]
["Terug naar Overzicht"]

{"sheet":"Ziekenhuis waar operatie heeft","index":13,"n_rows":23,"n_cols":2,"rows_kept":23,"cut":false,"hidden":false,"merged":[]}
["DATA_ID",{"$f":"INDEX(Overzicht_unique!$A:$AJ, MATCH($B$2,Overzicht_unique!$A:$A,0), 36)","v":"LROI010, LROI099, LROI199, LROI276, LROI366, LROI460, LROI558"}]
["LROI uitvraag","Ziekenhuis waar operatie heeft plaatsgevonden"]
["Variabelenaam XML","implantingProcedureHospital"]
["Variabelenaam database","hospital_location_id"]
["Label EN","Hospital in which this operation was performed "]
["Label NL","Ziekenhuis waar operatie heeft plaatsgevonden "]
["Definitie","Ziekenhuis (locatie nummer/code) waar operatie heeft plaatsgevonden"]
["Doel / reden uitvraag","Door LROI toegekend nummer aan de operatielocatie. Registratielocatie (ziekenhuisnummer/hospital id) heeft een of meerdere operatielocaties. "]
["Waarde verplicht","Technisch verplicht"]
["Datatype","Integer (INT)"]
["Domein (acceptabele range, min-max)"]
["Eenheid"]
["Format (max. lengte)"]
["Decimalen"]
["Codering","4 cijferig"]
["Periode","Sinds start registratie"]
["Wijziging (datum en reden)"]
["Noodzakelijk voor kwaliteitsindicatoren","Ja"]
["Opmerkingen"]
["Zorg Informatie Bouwsteen (ZIB)","ZIB: Verrichting\nContainer (1): Locatie::Zorgaanbieder\nContainer (2):\nDataelement: ZorgaanbiederIdentificatienummer; Postcode; OrganisatieLocatie\nOmzetting naar LROI:"]
["Voorbeeld","<implantingProcedureHospital>3340</implantingProcedureHospital>"]
[]
["Terug naar Overzicht"]

{"sheet":"Operatiezijde","index":14,"n_rows":23,"n_cols":2,"rows_kept":23,"cut":false,"hidden":false,"merged":[]}
["DATA_ID",{"$f":"INDEX(Overzicht_unique!$A:$AJ, MATCH($B$2,Overzicht_unique!$A:$A,0), 36)","v":"LROI011, LROI100, LROI200, LROI277, LROI367, LROI461, LROI559"}]
["LROI uitvraag","Operatiezijde"]
["Variabelenaam XML","procedureSide"]
["Variabelenaam database","procedure_side"]
["Label EN","Operation Side "]
["Label NL","Operatiezijde"]
["Definitie","Kant (links of rechts) van operatie "]
["Doel / reden uitvraag","Inzicht in kwaliteit; Kwaliteitsindicator 5b.Volledigheid registratie LROI. Volledig operatie-record: Ingrepen waarbij alle items die nodig zijn voor het berekenen van de externe indicatoren ingevuld zijn. Hieronder vallen: geslacht, geëncrypteerd BSN, geboortedatum, diagnose, ASA score, BMI, Charnley score, roken, datum van operatie, kant van operatie, type prothese, benadering, fixatie en soort prothese."]
["Waarde verplicht","Technisch verplicht"]
["Datatype","Integer (INT)"]
["Domein (acceptabele range, min-max)"]
["Eenheid"]
["Format (max. lengte)"]
["Decimalen"]
["Codering","1= Right (EN)/ Rechts (NL)\n2= Left (EN)/ Links (NL)"]
["Periode","Sinds start registratie"]
["Wijziging (datum en reden)"]
["Noodzakelijk voor kwaliteitsindicatoren","Ja"]
["Opmerkingen"]
["Zorg Informatie Bouwsteen (ZIB)","ZIB: Verrichting\nContainer (1):\nContainer (2):\nDataelement: VerrichtingLateraliteit\nOmzetting naar LROI:"]
["Voorbeeld","<procedureSide>2</procedureSide>"]
[]
["Terug naar Overzicht"]

{"sheet":"Positie prothese","index":15,"n_rows":23,"n_cols":2,"rows_kept":23,"cut":false,"hidden":false,"merged":[]}
["DATA_ID",{"$f":"INDEX(Overzicht_unique!$A:$AJ, MATCH($B$2,Overzicht_unique!$A:$A,0), 36)","v":"LROI560"}]
["LROI uitvraag","Positie prothese"]
["Variabelenaam XML","prosthesisPosition"]
["Variabelenaam database","position_pros"]
["Label EN","Position prosthesis"]
["Label NL","Positie prothese "]
["Definitie","Anatomische locatie van betreffende vinger "]
["Doel / reden uitvraag","Bepalen van type vinger van het te vervangen gewricht"]
["Waarde verplicht","Technisch verplicht"]
["Datatype","Integer (INT)"]
["Domein (acceptabele range, min-max)"]
["Eenheid"]
["Format (max. lengte)"]
["Decimalen"]
["Codering","1=1 thumb (EN) / duim (NL)\n2=2 index (EN) / wijsvinger (NL)\n3=3 middle (EN) / middelvinger (NL)\n4=4 ring (EN) / ringvinger (NL)\n5=5 small (EN) / pink (NL)"]
["Periode","Sinds start registratie"]
["Wijziging (datum en reden)"]
["Noodzakelijk voor kwaliteitsindicatoren","Nee"]
["Opmerkingen"]
["Zorg Informatie Bouwsteen (ZIB)","ZIB: Verrichting\nContainer (1):\nContainer (2):\nDataelement: VerrichtingAnatomischeLocatie\nOmzetting naar LROI:"]
["Voorbeeld","<prosthesisPosition>2</prosthesisPosition>"]
[]
["Terug naar Overzicht"]

{"sheet":"Locatie prothese","index":16,"n_rows":23,"n_cols":2,"rows_kept":23,"cut":false,"hidden":false,"merged":[]}
["DATA_ID",{"$f":"INDEX(Overzicht_unique!$A:$AJ, MATCH($B$2,Overzicht_unique!$A:$A,0), 36)","v":"LROI561"}]
["LROI uitvraag","Locatie prothese"]
["Variabelenaam XML","prosthesisLocation"]
["Variabelenaam database","Location_pros"]
["Label EN","Location prosthesis "]
["Label NL","Locatie prothese"]
["Definitie","Anatomische locatie van het vingergewricht"]
["Doel / reden uitvraag","Bepalen van type vingergewricht"]
["Waarde verplicht","Technisch verplicht"]
["Datatype","Integer (INT)"]
["Domein (acceptabele range, min-max)"]
["Eenheid"]
["Format (max. lengte)"]
["Decimalen"]
["Codering","1 = CMC \n2 = MCP \n3 = PIP \n4 = DIP "]
["Periode","Sinds start registratie"]
["Wijziging (datum en reden)"]
["Noodzakelijk voor kwaliteitsindicatoren","Nee"]
["Opmerkingen"]
["Zorg Informatie Bouwsteen (ZIB)","ZIB: Verrichting\nContainer (1):\nContainer (2):\nDataelement: VerrichtingAnatomischeLocatie\nOmzetting naar LROI:"]
["Voorbeeld","<prosthesisLocation>2</prosthesisLocation>"]
[]
["Terug naar Overzicht"]

{"sheet":"Postcode","index":17,"n_rows":23,"n_cols":2,"rows_kept":23,"cut":false,"hidden":false,"merged":[]}
["DATA_ID",{"$f":"INDEX(Overzicht_unique!$A:$AJ, MATCH($B$2,Overzicht_unique!$A:$A,0), 36)","v":"LROI012, LROI101, LROI201, LROI278, LROI368, LROI462, LROI562"}]
["LROI uitvraag","Postcode"]
["Variabelenaam XML","patientPostalcode"]
["Variabelenaam database","patient_postalcode"]
["Label EN","Postalcode "]
["Label NL","Postcode "]
["Definitie","Nederlandse postcode van het woonadres van de patiënt"]
["Doel / reden uitvraag","Inzicht in afstand van het woonadres patiënt tot operatielocatie"]
["Waarde verplicht","Functioneel verplicht"]
["Datatype","Integer (INT)"]
["Domein (acceptabele range, min-max)","Alléén cijfers (4 cijfers)"]
["Eenheid"]
["Format (max. lengte)",4]
["Decimalen"]
["Codering"]
["Periode","Sinds start registratie"]
["Wijziging (datum en reden)"]
["Noodzakelijk voor kwaliteitsindicatoren","Nee"]
["Opmerkingen","Bij buitenlandse postcode, dit veld leeglaten, en foreignPostalcode = 1"]
["Zorg Informatie Bouwsteen (ZIB)","ZIB: Patient\nContainer (1): Adresgegevens\nContainer (2):\nDataelement: Postcode\nOmzetting naar LROI:"]
["Voorbeeld","<patientPostalcode>5751</patientPostalcode>"]
[]
["Terug naar Overzicht"]

{"sheet":"Buitenlandse postcode","index":18,"n_rows":23,"n_cols":2,"rows_kept":23,"cut":false,"hidden":false,"merged":[]}
["DATA_ID",{"$f":"INDEX(Overzicht_unique!$A:$AJ, MATCH($B$2,Overzicht_unique!$A:$A,0), 36)","v":"LROI013, LROI102, LROI202, LROI279, LROI369, LROI463, LROI563"}]
["LROI uitvraag","Buitenlandse postcode"]
["Variabelenaam XML","foreignPostalCode"]
["Variabelenaam database"]
["Label EN","Foreign postalcode "]
["Label NL","Buitenlandse postcode "]
["Definitie","Postcode buiten Nederland "]
["Doel / reden uitvraag","Buitenlandse patiënten hebben geen BSN. Bij registratie van Buitenlandse postcode ‘Ja’ wordt de variabele ‘bsn’ als volledig gezien. Volledig operatie-record (Kwaliteitsindicator 5b): Ingrepen waarbij alle items die nodig zijn voor het berekenen van de externe indicatoren ingevuld zijn. Hieronder vallen: geslacht, geëncrypteerd BSN, geboortedatum, diagnose, ASA score, BMI, Charnley score, roken, datum van operatie, kant van operatie, type prothese, benadering, fixatie en soort prothese."]
["Waarde verplicht","Functioneel verplicht"]
["Datatype","Integer (INT)"]
["Domein (acceptabele range, min-max)"]
["Eenheid"]
["Format (max. lengte)"]
["Decimalen"]
["Codering","0 = No (EN)/ Nee (NL)\n1 = Yes (EN)/ Ja (NL)"]
["Periode","Sinds 01-01-2022 (LROI-ingrepen v5.1)"]
["Wijziging (datum en reden)"]
["Noodzakelijk voor kwaliteitsindicatoren","Ja (indirect)"]
["Opmerkingen"]
["Zorg Informatie Bouwsteen (ZIB)","ZIB: \nContainer (1):\nContainer (2):\nDataelement: \nOmzetting naar LROI:"]
["Voorbeeld","<foreignPostalCode>0</foreignPostalCode>"]
[]
["Terug naar Overzicht"]

{"sheet":"Lichaamslengte","index":19,"n_rows":23,"n_cols":2,"rows_kept":23,"cut":false,"hidden":false,"merged":[]}
["DATA_ID",{"$f":"INDEX(Overzicht_unique!$A:$AJ, MATCH($B$2,Overzicht_unique!$A:$A,0), 36)","v":"LROI014, LROI103, LROI203, LROI280, LROI370, LROI464, LROI564"}]
["LROI uitvraag","Lichaamslengte"]
["Variabelenaam XML","patientLength"]
["Variabelenaam database","patient_length"]
["Label EN","Body length "]
["Label NL","Lichaamslengte"]
["Definitie","Lichaamslengte in cm van de patiënt "]
["Doel / reden uitvraag","Bepalen van BMI; inzicht in patiëntkenmerken"]
["Waarde verplicht","Functioneel verplicht"]
["Datatype","Integer (INT)"]
["Domein (acceptabele range, min-max)","30-250"]
["Eenheid","Centimeters (cm)"]
["Format (max. lengte)",3]
["Decimalen"]
["Codering"]
["Periode","Sinds 2014; Version: January 1, 2014"]
["Wijziging (datum en reden)"]
["Noodzakelijk voor kwaliteitsindicatoren","Nee"]
["Opmerkingen"]
["Zorg Informatie Bouwsteen (ZIB)","ZIB: Lichaamslengte\nContainer (1):\nContainer (2):\nDataelement: LengteWaarde\nOmzetting naar LROI:"]
["Voorbeeld","<patientLength>186</patientLength>"]
[]
["Terug naar Overzicht"]

{"sheet":"Lichaamsgewicht","index":20,"n_rows":23,"n_cols":2,"rows_kept":23,"cut":false,"hidden":false,"merged":[]}
["DATA_ID",{"$f":"INDEX(Overzicht_unique!$A:$AJ, MATCH($B$2,Overzicht_unique!$A:$A,0), 36)","v":"LROI015, LROI104, LROI204, LROI281, LROI371, LROI465, LROI565"}]
["LROI uitvraag","Lichaamsgewicht"]
["Variabelenaam XML","patientWeight"]
["Variabelenaam database","patient_weight"]
["Label EN","Body weight"]
["Label NL","Lichaamsgewicht"]
["Definitie","Lichaamsgewicht in kg van de patiënt"]
["Doel / reden uitvraag","Bepalen van BMI; inzicht in patiëntkenmerken"]
["Waarde verplicht","Functioneel verplicht"]
["Datatype","Integer (INT)"]
["Domein (acceptabele range, min-max)","5-300"]
["Eenheid","Kilogram (kg)"]
["Format (max. lengte)",3]
["Decimalen"]
["Codering"]
["Periode","Sinds 2014; Version: January 1, 2014"]
["Wijziging (datum en reden)"]
["Noodzakelijk voor kwaliteitsindicatoren","Nee"]
["Opmerkingen"]
["Zorg Informatie Bouwsteen (ZIB)","ZIB: Lichaamsgewicht\nContainer (1):\nContainer (2):\nDataelement: GewichtWaarde\nOmzetting naar LROI:"]
["Voorbeeld","<patientWeight>90</patientWeight>"]
[]
["Terug naar Overzicht"]

{"sheet":"Roken","index":21,"n_rows":23,"n_cols":2,"rows_kept":23,"cut":false,"hidden":false,"merged":[]}
["DATA_ID",{"$f":"INDEX(Overzicht_unique!$A:$AJ, MATCH($B$2,Overzicht_unique!$A:$A,0), 36)","v":"LROI016, LROI105, LROI205, LROI282, LROI372, LROI466, LROI566"}]
["LROI uitvraag","Roken"]
["Variabelenaam XML","patientSmoking"]
["Variabelenaam database","smoking"]
["Label EN","Smoking "]
["Label NL","Roken "]
["Definitie","Tabakgebruik van de patiënt  "]
["Doel / reden uitvraag","Inzicht in patiëntkenmerken; Kwaliteitsindicator 5b.Volledigheid registratie LROI. Volledig operatie-record: Ingrepen waarbij alle items die nodig zijn voor het berekenen van de externe indicatoren ingevuld zijn. Hieronder vallen: geslacht, geëncrypteerd BSN, geboortedatum, diagnose, ASA score, BMI, Charnley score, roken, datum van operatie, kant van operatie, type prothese, benadering, fixatie en soort prothese."]
["Waarde verplicht","Functioneel verplicht"]
["Datatype","Integer (INT)"]
["Domein (acceptabele range, min-max)"]
["Eenheid"]
["Format (max. lengte)"]
["Decimalen"]
["Codering","0=No (EN)/ Nee (NL)\n1=Yes (EN)/ Ja (NL)"]
["Periode","Sinds 2014; Version: January 1, 2014"]
["Wijziging (datum en reden)"]
["Noodzakelijk voor kwaliteitsindicatoren","Ja"]
["Opmerkingen"]
["Zorg Informatie Bouwsteen (ZIB)","ZIB: Tabakgebruik\nContainer (1):\nContainer (2):\nDataelement: TabakGebruikStatus\nOmzetting naar LROI:"]
["Voorbeeld","<patientSmoking>0</patientSmoking>"]
[]
["Terug naar Overzicht"]

{"sheet":"BMI","index":22,"n_rows":23,"n_cols":2,"rows_kept":23,"cut":false,"hidden":false,"merged":[]}
["DATA_ID",{"$f":"INDEX(Overzicht_unique!$A:$AJ, MATCH($B$2,Overzicht_unique!$A:$A,0), 36)","v":"LROI017, LROI106, LROI206, LROI283, LROI373, LROI467, LROI567"}]
["LROI uitvraag","BMI"]
["Variabelenaam XML","patientBmi"]
["Variabelenaam database","bmi"]
["Label EN","BMI "]
["Label NL","BMI "]
["Definitie","Body Mass Index (BMI) van de patiënt.  "]
["Doel / reden uitvraag","Inzicht in patiëntkenmerken; Kwaliteitsindicator 5b.Volledigheid registratie LROI. Volledig operatie-record: Ingrepen waarbij alle items die nodig zijn voor het berekenen van de externe indicatoren ingevuld zijn. Hieronder vallen: geslacht, geëncrypteerd BSN, geboortedatum, diagnose, ASA score, BMI, Charnley score, roken, datum van operatie, kant van operatie, type prothese, benadering, fixatie en soort prothese."]
["Waarde verplicht","Functioneel verplicht"]
["Datatype","Integer (INT)"]
["Domein (acceptabele range, min-max)"]
["Eenheid"]
["Format (max. lengte)"]
["Decimalen","1 decimaal"]
["Codering"]
["Periode","Sinds 2014; Version: January 1, 2014"]
["Wijziging (datum en reden)"]
["Noodzakelijk voor kwaliteitsindicatoren"]
["Opmerkingen","Graag ‘lengte’ en ‘gewicht’ invullen of Body Mass Index (BMI). "]
["Zorg Informatie Bouwsteen (ZIB)","ZIB: \nContainer (1):\nContainer (2):\nDataelement: \nOmzetting naar LROI:"]
["Voorbeeld","<patientBmi>24.4</patientBmi>"]
[]
["Terug naar Overzicht"]

{"sheet":"Voorkeurshand","index":23,"n_rows":23,"n_cols":2,"rows_kept":23,"cut":false,"hidden":false,"merged":[]}
["DATA_ID","LROI284, LROI374, LROI468, LROI568"]
["LROI uitvraag","Voorkeurshand"]
["Variabelenaam XML","handedness"]
["Variabelenaam database","handedness"]
["Label EN","Handedness"]
["Label NL","Voorkeurshand"]
["Definitie","Voorkeurshand, 'actieve' hand, links- of rechtshandig"]
["Doel / reden uitvraag","Inzicht in patiëntkenmerken"]
["Waarde verplicht","Functioneel verplicht"]
["Datatype","Integer (INT)"]
["Domein (acceptabele range, min-max)"]
["Eenheid"]
["Format (max. lengte)"]
["Decimalen"]
["Codering","1=Right/Rechts\n2=Left/Links"]
["Periode","Sinds start registratie"]
["Wijziging (datum en reden)"]
["Noodzakelijk voor kwaliteitsindicatoren"]
["Opmerkingen"]
["Zorg Informatie Bouwsteen (ZIB)","ZIB: AlgemeneMeting\nContainer (1): MeetUitslag\nContainer (2):\nDataelement: Uitslagwaarde\nOmzetting naar LROI:"]
["Voorbeeld","<handedness>1</handedness>"]
[]
["Terug naar Overzicht"]

{"sheet":"Diagnose","index":24,"n_rows":23,"n_cols":2,"rows_kept":23,"cut":false,"hidden":false,"merged":[]}
["DATA_ID",{"$f":"INDEX(Overzicht_unique!$A:$AJ, MATCH($B$2,Overzicht_unique!$A:$A,0), 36)","v":"LROI018, LROI107, LROI207, LROI285, LROI375, LROI469, LROI59"}]
["LROI uitvraag","Diagnose"]
["Variabelenaam XML","diagnosis"]
["Variabelenaam database","diagnosis"]
["Label EN","Diagnosis "]
["Label NL","Diagnose"]
["Definitie","Primaire diagnose van de patiënt"]
["Doel / reden uitvraag","Inzicht in patiëntkenmerken; Kwaliteitsindicator 5b.Volledigheid registratie LROI. Volledig operatie-record: Ingrepen waarbij alle items die nodig zijn voor het berekenen van de externe indicatoren ingevuld zijn. Hieronder vallen: geslacht, geëncrypteerd BSN, geboortedatum, diagnose, ASA score, BMI, Charnley score, roken, datum van operatie, kant van operatie, type prothese, benadering, fixatie en soort prothese."]
["Waarde verplicht","Functioneel verplicht"]
["Datatype","Integer (INT)"]
["Domein (acceptabele range, min-max)"]
["Eenheid"]
["Format (max. lengte)"]
["Decimalen"]
["Codering","Heup: \n0=Osteoarthritis (OA)/ Artrose\n1=Dysplasie/ Dysplasie\n2=Rheumatoid arthritis (RA)/ Reumatoïde artritis\n3=Fracture (acute)/ Fractuur (acuut)\n4=Osteonecrosis/ Osteonecrose\n5=Post-Perthes/ Post-Perthes\n10=Tumour (primary)/ Tumor (primair)\n11=Tumour (metastasis)/ Tumor (metastase)\n12=Late posttraumatic/ Laat posttraumatisch\n13=Inflammatory Arthritis/ Inflammatoire artritis\n14=Post-infectious osteoarthritis/ Postinfectieuze artrose\n99=Other diagnosis, specify/ Andere diagnose, specificeer\nKnie: \n0=Osteoarthritis (OA)/ Artrose\n1=Late post-traumatic/\tLaat post-traumatisch\n2=Rheumatoid arthritis (RA)/ Reumatoïde artritis\n3=Osteonecrosis/ Osteonecrose\n6=Tumour (primary)/ Tumor (primair)\n7=Tumour (metastasis)/ Tumor (metastase)\n8=Inflammatory arthritis/ Inflammatoire artritis\n9=Fracture (acute)/ Fractuur (acuut)\n99=Other diagnosis, specify/ Andere diagnose, specificeer\nEnkel:\n0=Osteoarthritis (OA)/ Artrose\n1=Rheumatoid arthritis (RA)/ Reumatoïde artritis\n3=Osteonecrosis/ Osteonecrose\n4=Tumour (primary)/ Tumor (primair)\n5=Tumour (metastasis)/ Tumor (metastase)\n6=Posttraumatic/ Posttraumatisch\n7=Inflammatory Arthritis/ Inflammatoire artritis\n99=Other diagnosis, specify/ Andere diagnose, specificeer\nSchouder:\n0=Osteoarthritis (OA)/ Artrose\n1=Rheumatoid arthritis (RA)/ Reumatoïde artritis\n2=Fracture (acute)/ Fractuur (acuut)\n3=Osteonecrosis/ Osteonecrose\n4=Tumour (primary)/ Tumor (primair)\n5=Tumour (metastasis)/ Tumor (metastase)\n6=Late post-traumatic/\tLaat post-traumatisch\n7=Inflammatory Arthritis/ Inflammatoire artritis\n8=Cuff arthropathy/ Cuff artropathie\n9=Irreparable cuff rupture/ Onherstelbare cuff ruptuur\n10=Chronic (sub)dislocation/ Chronische (sub)luxatie\n99=Other diagnosis, specify/ Andere diagnose, specificeer\nElleboog: \n0=Osteoarthritis (OA)/\tArtrose\n1=Rheumatoid arthritis (RA)/ Reumatoïde artritis\n2=Fracture (acute)/ Fractuur (acuut)\n3=Osteonecrosis/ Osteonecrose\n4=Tumour (primary)/ Tumor (primair)\n5=Tumour (metastasis)/ Tumor (metastase)\n6=Late posttraumatic/ Laat posttraumatisch\n7=Inflammatory arthritis/ Inflammatoire artritis\n8=Hemophilic arthropathy/ Hemofilie artropathie\n99=Other diagnosis, specify/ Andere diagnose, specificeer\nPols:\n1=Osteoarthritis (OA)/ Artrose\n2=Rheumatoid arthritis (RA)/ Reumatoïde artritis\n3=Inflammatory/ Inflammatoire artritis\n4=Osteonecrosis/ Osteonecrose\n5=Posttraumatic/  Posttraumatisch\n6=Tumour (primary)/ Tumor (primair)\n7=Tumor (metastasis)/ Tumor (metastase)\n99=Other diagnosis, specify/ Andere diagnose, specificeer\nDuim/Vinger: \n0=Osteoarthritis (OA)/ Artrose\n1=Rheumatoid arthritis (RA)/ Reumatoïde artritis\n3=Osteonecrosis/ Osteonecrose\n4=Tumour (primary)/ Tumor (primair)\n5=Tumor (metastasis)/\tTumor (metastase)\n6=Posttraumatic/ Posttraumatisch\n7=Inflammatory arthritis/ Inflammatoire artritis\n99=Other diagnosis, specify/ Andere diagnose, specificeer"]
["Periode","Sinds start registratie"]
["Wijziging (datum en reden)","Wijzigingen in antwoordopties (codering/labelset) tijdens optimalisatierondes LROI formulieren in 2014, 2016 en 2022. Zie meest recente wijzigingen in (LROI-ingrepen v5.1; 01-01-2022)"]
["Noodzakelijk voor kwaliteitsindicatoren","Ja"]
["Opmerkingen","Alleen primaire diagnose is van belang"]
["Zorg Informatie Bouwsteen (ZIB)","ZIB: Verrichting\nContainer (1): Indicatie::Probleem\nContainer (2):\nDataelement: ProbleemNaam\nOmzetting naar LROI:"]
["Voorbeeld","<diagnosis>0</diagnosis>"]
[]
["Terug naar Overzicht"]

{"sheet":"Andere diagnose, specificeer","index":25,"n_rows":23,"n_cols":2,"rows_kept":23,"cut":false,"hidden":false,"merged":[]}
["DATA_ID",{"$f":"INDEX(Overzicht_unique!$A:$AJ, MATCH($B$2,Overzicht_unique!$A:$A,0), 36)","v":"LROI019, LROI108, LROI208, LROI286, LROI376, LROI470, LROI570"}]
["LROI uitvraag","Andere diagnose, specificeer"]
["Variabelenaam XML","diagnosisOther"]
["Variabelenaam database","diagnosis_other"]
["Label EN","Other diagnosis, specify "]
["Label NL","Andere diagnose, specificeer"]
["Definitie","Primaire diagnose van de patiënt anders dan keuzemogelijkheden "]
["Doel / reden uitvraag","Leren en verbeteren; inzicht in diagnoses die niet tot de keuzemogelijkheden behoren "]
["Waarde verplicht","Functioneel verplicht wanneer er ‘Andere diagnose’ geregistreerd is"]
["Datatype","Tekst (TXT)"]
["Domein (acceptabele range, min-max)"]
["Eenheid"]
["Format (max. lengte)",128]
["Decimalen"]
["Codering"]
["Periode","Sinds start registratie"]
["Wijziging (datum en reden)"]
["Noodzakelijk voor kwaliteitsindicatoren","Nee"]
["Opmerkingen","Specifieerveld in tekst"]
["Zorg Informatie Bouwsteen (ZIB)","ZIB: n.v.t.\nContainer (1):\nContainer (2):\nDataelement: \nOmzetting naar LROI:"]
["Voorbeeld","<diagnosisOther>Wegeners granulomatose</diagnosisOther>"]
[]
["Terug naar Overzicht"]

{"sheet":"Locatie artrose","index":26,"n_rows":23,"n_cols":2,"rows_kept":23,"cut":false,"hidden":false,"merged":[]}
["DATA_ID",{"$f":"INDEX(Overzicht_unique!$A:$AJ, MATCH($B$2,Overzicht_unique!$A:$A,0), 36)","v":"LROI109"}]
["LROI uitvraag","Locatie artrose"]
["Variabelenaam XML","locationOsteoarthritis"]
["Variabelenaam database","location_osteoarthritis"]
["Label EN","Location osteoarthritis"]
["Label NL","Locatie artrose"]
["Definitie","Locatie van artrose van het kniegwricht. Artrose van het mediale femurotibiale compartiment of van het laterale femurotibiale compartiment of van het patellofemorale compartiment of meerdere van de beschreven compartimenten (diffuus) zijn aangedaan. "]
["Doel / reden uitvraag","Diagnose artrose verder gespecificeerd. Inzicht in type/locatie artrose."]
["Waarde verplicht","Functioneel verplicht"]
["Datatype","Integer (INT)"]
["Domein (acceptabele range, min-max)"]
["Eenheid"]
["Format (max. lengte)"]
["Decimalen"]
["Codering","0=Medial/Mediaal\n1=Lateral/Lateraal\n2=Patellofemoral/Patellofemoraal\n3=Diffuse/Diffuus"]
["Periode","Sinds LROI-ingrepen v5.1; 01-01-2022"]
["Wijziging (datum en reden)","Primaire diagnose artrose verder specificeren."]
["Noodzakelijk voor kwaliteitsindicatoren","Nee"]
["Opmerkingen"]
["Zorg Informatie Bouwsteen (ZIB)","ZIB: n.v.t.\nContainer (1):\nContainer (2):\nDataelement: \nOmzetting naar LROI:"]
["Voorbeeld","<locationOsteoarthritis>3</locationOsteoarthritis>"]
[]
["Terug naar Overzicht"]

{"sheet":"ASA classificatie","index":27,"n_rows":23,"n_cols":2,"rows_kept":23,"cut":false,"hidden":false,"merged":[]}
["DATA_ID",{"$f":"INDEX(Overzicht_unique!$A:$AJ, MATCH($B$2,Overzicht_unique!$A:$A,0), 36)","v":"LROI020, LROI110, LROI209, LROI287, LROI377, LROI471, LROI571"}]
["LROI uitvraag","ASA classificatie"]
["Variabelenaam XML","asaClassification"]
["Variabelenaam database","asa"]
["Label EN","ASA classification "]
["Label NL","ASA classificatie"]
["Definitie","De ASA-classificatie is het American Society of Anesthesiologists classificatiesysteem voor fysieke status (algehele medische toestand)."]
["Doel / reden uitvraag","Inzicht in patiëntkenmerken; Kwaliteitsindicator 5b.Volledigheid registratie LROI. Volledig operatie-record: Ingrepen waarbij alle items die nodig zijn voor het berekenen van de externe indicatoren ingevuld zijn. Hieronder vallen: geslacht, geëncrypteerd BSN, geboortedatum, diagnose, ASA score, BMI, Charnley score, roken, datum van operatie, kant van operatie, type prothese, benadering, fixatie en soort prothese."]
["Waarde verplicht","Functioneel verplicht"]
["Datatype","Integer (INT)"]
["Domein (acceptabele range, min-max)"]
["Eenheid"]
["Format (max. lengte)"]
["Decimalen"]
["Codering (EN/NL)","1= ASA I Normal healty patient/ ASA I Normaal gezonde patiënt\n2= ASA II Patient with mild systemic disease/ ASA II Patiënt met matige systemische afwijkingen\n3= ASA III Patient with severe systemic disease that is limiting but not incapacitating/ ASA III Patiënt met ernstige systemische afwijkingen, die beperken maar niet invalideren\n4= ASA IV Patient with incapacitating disease that is a constant threat to life/ ASA IV Patiënt met zeer ernstige afwijkingen, die chronisch bedreigend zijn voor het leven"]
["Periode","Sinds start registratie"]
["Wijziging (datum en reden)"]
["Noodzakelijk voor kwaliteitsindicatoren","Ja"]
["Opmerkingen"]
["Zorg Informatie Bouwsteen (ZIB)","ZIB: AlgemeneMeting\nContainer (1): MeetUitslag\nContainer (2):\nDataelement: UitslagWaarde; MetingNaam; UitslagDatumTijd\nOmzetting naar LROI:"]
["Voorbeeld","<asaClassification>1</asaClassification>"]
[]
["Terug naar Overzicht"]

{"sheet":"Charnley classificatie","index":28,"n_rows":23,"n_cols":2,"rows_kept":23,"cut":false,"hidden":false,"merged":[]}
["DATA_ID",{"$f":"INDEX(Overzicht_unique!$A:$AJ, MATCH($B$2,Overzicht_unique!$A:$A,0), 36)","v":"LROI021, LROI111, LROI210"}]
["LROI uitvraag","Charnley classificatie"]
["Variabelenaam XML","charnleyClassification"]
["Variabelenaam database","charnley"]
["Label EN","Charnley classification"]
["Label NL","Charnley classificatie"]
["Definitie","Klinisch classificatiesysteem"]
["Doel / reden uitvraag","Inzicht in patiëntkenmerken; Kwaliteitsindicator 5b.Volledigheid registratie LROI. Volledig operatie-record: Ingrepen waarbij alle items die nodig zijn voor het berekenen van de externe indicatoren ingevuld zijn. Hieronder vallen: geslacht, geëncrypteerd BSN, geboortedatum, diagnose, ASA score, BMI, Charnley score, roken, datum van operatie, kant van operatie, type prothese, benadering, fixatie en soort prothese."]
["Waarde verplicht","Functioneel verplicht"]
["Datatype","Integer (INT)"]
["Domein (acceptabele range, min-max)"]
["Eenheid"]
["Format (max. lengte)"]
["Decimalen"]
["Codering (EN/NL)","0= A Single joint with OA/ A Eén gewricht aangedaan met artrose\n1= B1 Bilateral joints with OA/ B1 Beide gewrichten aangedaan met artrose\n2= B2 Previous prosthesis on the contral joint/ B2 Contralaterale gewricht met een prothese\n3= C Multiple joints affected with OA or a chronic disease/ C Meerdere gewrichten aangedaan door artrose of een chronische ziekte die de kwaliteit van leven beïnvloedt (voornamelijk lopen)\n8= Not applicable/ Niet van toepassing, geen sprake van artrose"]
["Periode","Sinds 2014; Version: January 1, 2014"]
["Wijziging (datum en reden)"]
["Noodzakelijk voor kwaliteitsindicatoren","Ja"]
["Opmerkingen"]
["Zorg Informatie Bouwsteen (ZIB)","ZIB: geen zib\nContainer (1): \nContainer (2):\nDataelement: UitslagWaarde; MetingNaam; UitslagDatumTijd\nOmzetting naar LROI:"]
["Voorbeeld","<charnleyClassification>1</charnleyClassification>"]
[]
["Terug naar Overzicht"]

{"sheet":"Walch classificatie","index":29,"n_rows":23,"n_cols":2,"rows_kept":23,"cut":false,"hidden":false,"merged":[]}
["DATA_ID",{"$f":"INDEX(Overzicht_unique!$A:$AJ, MATCH($B$2,Overzicht_unique!$A:$A,0), 36)","v":"LROI288"}]
["LROI uitvraag","Walch classificatie"]
["Variabelenaam XML","walch"]
["Variabelenaam database","walch"]
["Label EN","Walch classification"]
["Label NL","Walch classificatie"]
["Definitie","Klinisch classificatiesysteem voor mate en type van slijtage van het schoudergewricht"]
["Doel / reden uitvraag","Inzicht in patiëntkenmerken"]
["Waarde verplicht","Functioneel verplicht"]
["Datatype","Integer (INT)"]
["Domein (acceptabele range, min-max)"]
["Eenheid"]
["Format (max. lengte)"]
["Decimalen"]
["Codering (EN/NL)","0=A1 Humeral head centered, minor erosion glenoid/A1 Humeruskop gecentreerd, minimale erosie schouderkom\n1=A2 Humeral head centered, major erosion glenoid/A2 Humeruskop gecentreerd, forse erosie schouderkom\n2=B1 Humeral head subluxed posteriorly/B1 Posterieure subluxatie humeruskop, posterieure gewrichtsruimte smal, subchondriale sclerose en osteofyten\n3=B2 Humeral head subluxed posteriorly/B2 Posterieure subluxatie humeruskop, retroversie schouderkom met posterieure erosie\n4=B3 Humeral head subluxed posteriorly >70%/B3 Posterieure subluxatie humeruskop (>70%), retroversie schouderkom > 10 graden\n5=C Glenoid retroversion > 25 degr/C Retroversie schouderkom >25 graden ongeacht erosie\n99=Not applicable/Niet van toepassing, geen sprake van artrose"]
["Periode","Sinds 2014; Version: January 1, 2014"]
["Wijziging (datum en reden)"]
["Noodzakelijk voor kwaliteitsindicatoren","Nee"]
["Opmerkingen"]
["Zorg Informatie Bouwsteen (ZIB)","ZIB: AlgemeneMeting\nContainer (1): MeetUitslag\nContainer (2):\nDataelement: UitslagWaarde; MetingNaam; UitslagDatumTijd\nOmzetting naar LROI:"]
["Voorbeeld","<walch>0</walch>"]
[]
["Terug naar Overzicht"]

{"sheet":"Infectie","index":30,"n_rows":23,"n_cols":2,"rows_kept":23,"cut":false,"hidden":false,"merged":[]}
["DATA_ID",{"$f":"INDEX(Overzicht_unique!$A:$AJ, MATCH($B$2,Overzicht_unique!$A:$A,0), 36)","v":"LROI022, LROI112, LROI211, LROI289, LROI378, LROI472"}]
["LROI uitvraag","Infectie"]
["Variabelenaam XML","infection"]
["Variabelenaam database","rr_infection"]
["Label EN","Infection"]
["Label NL","Infectie"]
["Definitie","Gewrichtsinfectie, zowel vroege infectie veroorzaakt op het moment van plaatsing van de prothese, als latere infecties van hematogene aard"]
["Doel / reden uitvraag","Inzicht in revisie-operaties en kwaliteit; Kwaliteitsindicator 2ab: Volume knierevisies als gevolg van /zonder (verdenking op) infectie"]
["Waarde verplicht","Functioneel verplicht"]
["Datatype","Integer (INT)"]
["Domein (acceptabele range, min-max)"]
["Eenheid"]
["Format (max. lengte)"]
["Decimalen"]
["Codering (EN/NL)","0=No/ Nee\n1=Yes/ Ja"]
["Periode","Sinds start registratie"]
["Wijziging (datum en reden)"]
["Noodzakelijk voor kwaliteitsindicatoren","Ja"]
["Opmerkingen"]
["Zorg Informatie Bouwsteen (ZIB)","ZIB: Verrichting\nContainer (1): Indicatie::Probleem\nContainer (2):\nDataelement: ProbleemNaam\nOmzetting naar LROI:"]
["Voorbeeld","<infection>1</infection>"]
[]
["Terug naar Overzicht"]

{"sheet":"Slijtage cup lager","index":31,"n_rows":23,"n_cols":2,"rows_kept":23,"cut":false,"hidden":false,"merged":[]}
["DATA_ID",{"$f":"INDEX(Overzicht_unique!$A:$AJ, MATCH($B$2,Overzicht_unique!$A:$A,0), 36)","v":"LROI023"}]
["LROI uitvraag","Slijtage cup/lager"]
["Variabelenaam XML","cupLinerWear"]
["Variabelenaam database","rr_wear_bear"]
["Label EN","Wear cup/liner"]
["Label NL","Slijtage cup/lager"]
["Definitie","Slijtage (beschadiging) van polyethyleen cup/lager veroorzaakt door instabiliteit of lange termijn gebruik van de heupprothese, hetgeen zich ook kan uiten als osteolyse "]
["Doel / reden uitvraag","Inzicht in revisie-operaties en kwaliteit"]
["Waarde verplicht","Functioneel verplicht"]
["Datatype","Integer (INT)"]
["Domein (acceptabele range, min-max)"]
["Eenheid"]
["Format (max. lengte)"]
["Decimalen"]
["Codering (EN/NL)","0=No/ Nee\n1=Yes/ Ja"]
["Periode","Sinds start registratie"]
["Wijziging (datum en reden)"]
["Noodzakelijk voor kwaliteitsindicatoren","Nee"]
["Opmerkingen"]
["Zorg Informatie Bouwsteen (ZIB)","ZIB: Verrichting\nContainer (1): Indicatie::Probleem\nContainer (2):\nDataelement: ProbleemNaam\nOmzetting naar LROI:"]
["Voorbeeld","<cupLinerWear>1</cupLinerWear>"]
[]
["Terug naar Overzicht"]

{"sheet":"Slijtage van insert","index":32,"n_rows":23,"n_cols":2,"rows_kept":23,"cut":false,"hidden":false,"merged":[]}
["DATA_ID",{"$f":"INDEX(Overzicht_unique!$A:$AJ, MATCH($B$2,Overzicht_unique!$A:$A,0), 36)","v":"LROI115"}]
["LROI uitvraag","Slijtage van insert"]
["Variabelenaam XML","wearInlay"]
["Variabelenaam database","rr_wear_inlay"]
["Label EN","Wear insert"]
["Label NL","Slijtage van insert"]
["Definitie","Slijtage (beschadiging) van polyethyleen insert, vaak veroorzaakt door instabiliteit of lange termijn gebruik van de knieprothese"]
["Doel / reden uitvraag","Inzicht in revisie-operaties en kwaliteit"]
["Waarde verplicht","Functioneel verplicht"]
["Datatype","Integer (INT)"]
["Domein (acceptabele range, min-max)"]
["Eenheid"]
["Format (max. lengte)"]
["Decimalen"]
["Codering (EN/NL)","0=No/ Nee\n1=Yes/ Ja"]
["Periode","Sinds start registratie"]
["Wijziging (datum en reden)"]
["Noodzakelijk voor kwaliteitsindicatoren","Nee"]
["Opmerkingen"]
["Zorg Informatie Bouwsteen (ZIB)","ZIB: Verrichting\nContainer (1): Indicatie::Probleem\nContainer (2):\nDataelement: ProbleemNaam\nOmzetting naar LROI:"]
["Voorbeeld","<wearInlay>1</wearInlay>"]
[]
["Terug naar Overzicht"]

{"sheet":"Slijtage inlay","index":33,"n_rows":23,"n_cols":2,"rows_kept":23,"cut":false,"hidden":false,"merged":[]}
["DATA_ID",{"$f":"INDEX(Overzicht_unique!$A:$AJ, MATCH($B$2,Overzicht_unique!$A:$A,0), 36)","v":"LROI212"}]
["LROI uitvraag","Slijtage inlay"]
["Variabelenaam XML","wearOfInlay"]
["Variabelenaam database","rr_wear_inlay"]
["Label EN","Wear inlay"]
["Label NL","Slijtage inlay"]
["Definitie","Slijtage (beschadiging) van polyethyleen inlay vaak veroorzaakt door instabiliteit of lange termijn gebruik van de enkelprothese"]
["Doel / reden uitvraag","Inzicht in revisie-operaties en kwaliteit"]
["Waarde verplicht","Functioneel verplicht"]
["Datatype","Integer (INT)"]
["Domein (acceptabele range, min-max)"]
["Eenheid"]
["Format (max. lengte)"]
["Decimalen"]
["Codering (EN/NL)","0=No/ Nee\n1=Yes/ Ja"]
["Periode","Sinds start registratie"]
["Wijziging (datum en reden)"]
["Noodzakelijk voor kwaliteitsindicatoren","Nee"]
["Opmerkingen"]
["Zorg Informatie Bouwsteen (ZIB)","ZIB: Verrichting\nContainer (1): Indicatie::Probleem\nContainer (2):\nDataelement: ProbleemNaam\nOmzetting naar LROI:"]
["Voorbeeld","<wearOfInlay>1</wearOfInlay>"]
[]
["Terug naar Overzicht"]

{"sheet":"Slijtage van polyethyleen","index":34,"n_rows":23,"n_cols":2,"rows_kept":23,"cut":false,"hidden":false,"merged":[]}
["DATA_ID",{"$f":"INDEX(Overzicht_unique!$A:$AJ, MATCH($B$2,Overzicht_unique!$A:$A,0), 36)","v":"LROI379"}]
["LROI uitvraag","Slijtage van polyethyleen"]
["Variabelenaam XML","polyethyleneWear"]
["Variabelenaam database","rr_wear_pe"]
["Label EN","Wear polyethylene"]
["Label NL","Slijtage van polyethyleen"]
["Definitie","Slijtage (beschadiging) van polyethyleen insert vaak veroorzaakt door instabiliteit of lange termijn gebruik van de elleboogprothese"]
["Doel / reden uitvraag","Inzicht in revisie-operaties en kwaliteit"]
["Waarde verplicht","Functioneel verplicht"]
["Datatype","Integer (INT)"]
["Domein (acceptabele range, min-max)"]
["Eenheid"]
["Format (max. lengte)"]
["Decimalen"]
["Codering (EN/NL)","0=No/ Nee\n1=Yes/ Ja"]
["Periode","Sinds start registratie"]
["Wijziging (datum en reden)"]
["Noodzakelijk voor kwaliteitsindicatoren","Nee"]
["Opmerkingen"]
["Zorg Informatie Bouwsteen (ZIB)","ZIB: Verrichting\nContainer (1): Indicatie::Probleem\nContainer (2):\nDataelement: ProbleemNaam\nOmzetting naar LROI:"]
["Voorbeeld","<polyethyleneWear>1</polyethyleneWear>"]
[]
["Terug naar Overzicht"]

{"sheet":"Periprothetische fractuur","index":35,"n_rows":23,"n_cols":2,"rows_kept":23,"cut":false,"hidden":false,"merged":[]}
["DATA_ID",{"$f":"INDEX(Overzicht_unique!$A:$AJ, MATCH($B$2,Overzicht_unique!$A:$A,0), 36)","v":"LROI024, LROI116, LROI213, LROI290, LROI380, LROI473"}]
["LROI uitvraag","Periprothetische fractuur"]
["Variabelenaam XML","periprostheticFracture"]
["Variabelenaam database","rr_peripros_fracture"]
["Label EN","Periprosthetic fracture"]
["Label NL","Periprothetische fractuur"]
["Definitie","Fractuur rondom de heup-, knie-, enkel-, schouder-, elleboog- of polsprothese waardoor de fixatie of stabiliteit van de prothese onderbroken wordt en revisiechirurgie nodig is "]
["Doel / reden uitvraag","Inzicht in revisie-operaties en kwaliteit"]
["Waarde verplicht","Functioneel verplicht"]
["Datatype","Integer (INT)"]
["Domein (acceptabele range, min-max)"]
["Eenheid"]
["Format (max. lengte)"]
["Decimalen"]
["Codering (EN/NL)","0=No/ Nee\n1=Yes/ Ja"]
["Periode","Sinds start registratie"]
["Wijziging (datum en reden)"]
["Noodzakelijk voor kwaliteitsindicatoren","Nee"]
["Opmerkingen"]
["Zorg Informatie Bouwsteen (ZIB)","ZIB: Verrichting\nContainer (1): Indicatie::Probleem\nContainer (2):\nDataelement: ProbleemNaam\nOmzetting naar LROI:"]
["Voorbeeld","<periprostheticFracture>1</periprostheticFracture>"]
[]
["Terug naar Overzicht"]

{"sheet":"Malpositie of malalignment","index":36,"n_rows":23,"n_cols":2,"rows_kept":23,"cut":false,"hidden":false,"merged":[]}
["DATA_ID",{"$f":"INDEX(Overzicht_unique!$A:$AJ, MATCH($B$2,Overzicht_unique!$A:$A,0), 36)","v":"LROI025, LROI117, LROI291, LROI381, LROI476, LROI572"}]
["LROI uitvraag","Malpositie of malalignment"]
["Variabelenaam XML","malalignment"]
["Variabelenaam database","rr_malalignment"]
["Label EN","Malposition or malalignment"]
["Label NL","Malpositie of malalignment"]
["Definitie","Geen goede positionering en/of alignment van de heup-, knie-, schouder-, elleboog-, pols- of duim/vingerprothese"]
["Doel / reden uitvraag","Inzicht in revisie-operaties en kwaliteit"]
["Waarde verplicht","Functioneel verplicht"]
["Datatype","Integer (INT)"]
["Domein (acceptabele range, min-max)"]
["Eenheid"]
["Format (max. lengte)"]
["Decimalen"]
["Codering (EN/NL)","0=No/ Nee\n1=Yes/ Ja"]
["Periode","Sinds start registratie (geldt niet voor alle gewrichten)"]
["Wijziging (datum en reden)","Nieuw toegevoegd of term gewijzigd (voorheen malalignment) in LROI-ingrepen v5.1; 01-01-2022. Bij heup komt dit relatief weinig voor, maar is hier toegevoegd om verwarring te voorkomen. Gezien de definitie beschouwt men hier malalignment als overkoepelende term voor malpositie + malalignment. Term daarom hernoemt naar Malpositie of malaligment, zodat de term weer in overeenstemming is met de definitie. "]
["Noodzakelijk voor kwaliteitsindicatoren","Nee"]
["Opmerkingen"]
["Zorg Informatie Bouwsteen (ZIB)","ZIB: Verrichting\nContainer (1): Indicatie::Probleem\nContainer (2):\nDataelement: ProbleemNaam\nOmzetting naar LROI:"]
["Voorbeeld","<malalignment>1</malalignment>"]
[]
["Terug naar Overzicht"]

{"sheet":"Malalignment","index":37,"n_rows":23,"n_cols":2,"rows_kept":23,"cut":false,"hidden":false,"merged":[]}
["DATA_ID","LROI214"]
["LROI uitvraag","Malalignment"]
["Variabelenaam XML","malalignment"]
["Variabelenaam database","rr_malalignment"]
["Label EN","Malalignment"]
["Label NL","Malalignment"]
["Definitie","De enkelprothese faalt door de afwijkende stand van de enkel en/of voet"]
["Doel / reden uitvraag","Inzicht in revisie-operaties en kwaliteit"]
["Waarde verplicht","Functioneel verplicht"]
["Datatype","Integer (INT)"]
["Domein (acceptabele range, min-max)"]
["Eenheid"]
["Format (max. lengte)"]
["Decimalen"]
["Codering (EN/NL)","0=No/ Nee\n1=Yes/ Ja"]
["Periode","Sinds start registratie (geldt niet voor alle gewrichten)"]
["Wijziging (datum en reden)"," Definitie gewijzigd in LROI-ingrepen v5.1; 01-01-2022. Er moet onderscheid komen tussen malalignment en malpositie van de enkelprothese."]
["Noodzakelijk voor kwaliteitsindicatoren","Nee"]
["Opmerkingen"]
["Zorg Informatie Bouwsteen (ZIB)","ZIB: Verrichting\nContainer (1): Indicatie::Probleem\nContainer (2):\nDataelement: ProbleemNaam\nOmzetting naar LROI:"]
["Voorbeeld","<malalignment>1</malalignment>"]
[]
["Terug naar Overzicht"]

{"sheet":"Malpositie","index":38,"n_rows":23,"n_cols":2,"rows_kept":23,"cut":false,"hidden":false,"merged":[]}
["DATA_ID",{"$f":"INDEX(Overzicht_unique!$A:$AJ, MATCH($B$2,Overzicht_unique!$A:$A,0), 36)","v":"LROI215"}]
["LROI uitvraag","Malpositie"]
["Variabelenaam XML","malposition"]
["Variabelenaam database","rr_malposition"]
["Label EN","Malposition"]
["Label NL","Malpositie"]
["Definitie","De enkelprothese faalt door het verkeerd plaatsen van één of beide van de enkelprothese componenten"]
["Doel / reden uitvraag","Inzicht in revisie-operaties en kwaliteit"]
["Waarde verplicht","Functioneel verplicht"]
["Datatype","Integer (INT)"]
["Domein (acceptabele range, min-max)"]
["Eenheid"]
["Format (max. lengte)"]
["Decimalen"]
["Codering (EN/NL)","0=No/ Nee\n1=Yes/ Ja"]
["Periode","Sinds LROI-ingrepen v5.1; 01-01-2022"]
["Wijziging (datum en reden)"," Toegevoegd in LROI-ingrepen v5.1; 01-01-2022. Er moet onderscheid komen tussen malalignement en malpositie van de enkelprothese."]
["Noodzakelijk voor kwaliteitsindicatoren","Nee"]
["Opmerkingen"]
["Zorg Informatie Bouwsteen (ZIB)","ZIB: Verrichting\nContainer (1): Indicatie::Probleem\nContainer (2):\nDataelement: ProbleemNaam\nOmzetting naar LROI:"]
["Voorbeeld","<malalignment>1</malalignment>"]
[]
["Terug naar Overzicht"]

{"sheet":"Luxatie","index":39,"n_rows":23,"n_cols":2,"rows_kept":23,"cut":false,"hidden":false,"merged":[]}
["DATA_ID",{"$f":"INDEX(Overzicht_unique!$A:$AJ, MATCH($B$2,Overzicht_unique!$A:$A,0), 36)","v":"LROI026, LROI475, LROI574"}]
["LROI uitvraag","Luxatie"]
["Variabelenaam XML","dislocation"]
["Variabelenaam database","rr_disloc"]
["Label EN","Dislocation"]
["Label NL","Luxatie"]
["Definitie","Terugkerende (sub)luxatie van de heup-, pols- of duim/vingerprothese"]
["Doel / reden uitvraag","Inzicht in revisie-operaties en kwaliteit"]
["Waarde verplicht","Functioneel verplicht"]
["Datatype","Integer (INT)"]
["Domein (acceptabele range, min-max)"]
["Eenheid"]
["Format (max. lengte)"]
["Decimalen"]
["Codering (EN/NL)","0=No/ Nee\n1=Yes/ Ja"]
["Periode","Sinds start registratie"]
["Wijziging (datum en reden)","Term gewijzigd (voorheen dislocatie) in LROI-ingrepen v5.1; 01-01-2022. Tussen de gewrichten wordt de term “Dislocatie” en “Luxatie” door elkaar heen gebruikt. Voorstel is om consequent “Luxatie” te gebruiken, in het Engels “Dislocation”. (“Dislocatie”, Engels: “Displacement”, gebruiken we specifiek niet om verwarring te voorkomen)."]
["Noodzakelijk voor kwaliteitsindicatoren","Nee"]
["Opmerkingen"]
["Zorg Informatie Bouwsteen (ZIB)","ZIB: Verrichting\nContainer (1): Indicatie::Probleem\nContainer (2):\nDataelement: ProbleemNaam\nOmzetting naar LROI:"]
["Voorbeeld","<dislocation>1</dislocation>"]
[]
["Terug naar Overzicht"]

{"sheet":"Luxatie patella","index":40,"n_rows":23,"n_cols":2,"rows_kept":23,"cut":false,"hidden":false,"merged":[]}
["DATA_ID",{"$f":"INDEX(Overzicht_unique!$A:$AJ, MATCH($B$2,Overzicht_unique!$A:$A,0), 36)","v":"LROI113"}]
["LROI uitvraag","Luxatie patella"]
["Variabelenaam XML","patellaDislocation"]
["Variabelenaam database","rr_patella_disloc"]
["Label EN","Patella dislocation"]
["Label NL","Luxatie patella"]
["Definitie","Terugkerende luxatie van de patellacomponent"]
["Doel / reden uitvraag","Inzicht in revisie-operaties en kwaliteit"]
["Waarde verplicht","Functioneel verplicht"]
["Datatype","Integer (INT)"]
["Domein (acceptabele range, min-max)"]
["Eenheid"]
["Format (max. lengte)"]
["Decimalen"]
["Codering (EN/NL)","0=No/ Nee\n1=Yes/ Ja"]
["Periode","Sinds start registratie"]
["Wijziging (datum en reden)","Term gewijzigd (voorheen patella dislocatie) in LROI-ingrepen v5.1; 01-01-2022. Tussen de gewrichten wordt de term “Dislocatie” en “Luxatie” door elkaar heen gebruikt. Voorstel is om consequent “Luxatie” te gebruiken, in het Engels “Dislocation”. (“Dislocatie”, Engels: “Displacement”, gebruiken we specifiek niet om verwarring te voorkomen)."]
["Noodzakelijk voor kwaliteitsindicatoren","Nee"]
["Opmerkingen"]
["Zorg Informatie Bouwsteen (ZIB)","ZIB: Verrichting\nContainer (1): Indicatie::Probleem\nContainer (2):\nDataelement: ProbleemNaam\nOmzetting naar LROI:"]
["Voorbeeld","<patellaDislocation>1</patellaDislocation>"]
[]
["Terug naar Overzicht"]

{"sheet":"Luxatie bearing","index":41,"n_rows":23,"n_cols":2,"rows_kept":23,"cut":false,"hidden":false,"merged":[]}
["DATA_ID",{"$f":"INDEX(Overzicht_unique!$A:$AJ, MATCH($B$2,Overzicht_unique!$A:$A,0), 36)","v":"LROI114"}]
["LROI uitvraag","Luxatie bearing"]
["Variabelenaam XML","bearingDislocation"]
["Variabelenaam database","rr_bearing_dislocation"]
["Label EN","Dislocation bearing"]
["Label NL","Luxatie bearing"]
["Definitie","Luxatie van de mobile bearing, fixed bearing of rotating platform"]
["Doel / reden uitvraag","Inzicht in revisie-operaties en kwaliteit"]
["Waarde verplicht","Functioneel verplicht"]
["Datatype","Integer (INT)"]
["Domein (acceptabele range, min-max)"]
["Eenheid"]
["Format (max. lengte)"]
["Decimalen"]
["Codering (EN/NL)","0=No/ Nee\n1=Yes/ Ja"]
["Periode","Sinds LROI-ingrepen v5.1; 01-01-2022"]
["Wijziging (datum en reden)","Geeft inzicht in het faalmechanisme wat gerelateerd is aan het design (mobile bearing / rotating platform / locking mechanisme van de fixed bearing)."]
["Noodzakelijk voor kwaliteitsindicatoren","Nee"]
["Opmerkingen"]
["Zorg Informatie Bouwsteen (ZIB)","ZIB: Verrichting\nContainer (1): Indicatie::Probleem\nContainer (2):\nDataelement: ProbleemNaam\nOmzetting naar LROI:"]
["Voorbeeld","<bearingDislocation>1</bearingDislocation>"]
[]
["Terug naar Overzicht"]

{"sheet":"Instabiliteit of dislocatie","index":42,"n_rows":23,"n_cols":2,"rows_kept":23,"cut":false,"hidden":false,"merged":[]}
["DATA_ID",{"$f":"INDEX(Overzicht_unique!$A:$AJ, MATCH($B$2,Overzicht_unique!$A:$A,0), 36)","v":"LROI118, LROI292, LROI382, LROI474, LROI573"}]
["LROI uitvraag","Instabiliteit of dislocatie"]
["Variabelenaam XML","instability"]
["Variabelenaam database","rr_instability"]
["Label EN","Instability or displacement"]
["Label NL","Instabiliteit of dislocatie"]
["Definitie","Instabiliteit of dislocatie van de knieprothese, uitgezonderd luxatie patella, Luxatie bearing, malalignment of malpositie en loslating componenten; Instabiliteit of dislocatie van de schouderprothese (bijvoorbeeld luxatie en subluxatie), uitgezonderd malpositie of malalignment en loslating componenten; Instabiliteit of dislocatie van de elleboogprothese (bijvoorbeeld terugkerende luxatie) met als gevolg inadequate range of motion van de prothese, uitgezonderd malalignment; Instabiliteit of dislocatie van de polsprothese met als gevolg inadequate flexie van de prothese, uitgezonderd Luxatie, Malpositie of malalignment; Instabiliteit of dislocatie van de vingerprothese met als gevolg inadequate flexie van de prothese, uitgezonderd Luxatie, Malpositie of malalignment, en loslating componenten"]
["Doel / reden uitvraag","Inzicht in revisie-operaties en kwaliteit"]
["Waarde verplicht","Functioneel verplicht"]
["Datatype","Integer (INT)"]
["Domein (acceptabele range, min-max)"]
["Eenheid"]
["Format (max. lengte)"]
["Decimalen"]
["Codering (EN/NL)","0=No/ Nee\n1=Yes/ Ja"]
["Periode","Sinds start registratie knie, schouder, elleboog, pols; Vinger sinds LROI-ingrepen v5.1 01-01-2022"]
["Wijziging (datum en reden)","Term gewijzigd (voorheen instabiliteit) in LROI-ingrepen v5.1; 01-01-2022. Bij aantal gewrichten wordt de term “Instabiliteit” gebruikt en bij andere “Dislocatie”. Om dit te ondervangen de term nu aangepast naar “Instabiliteit of dislocatie  ” voor alle gewrichten."]
["Noodzakelijk voor kwaliteitsindicatoren","Nee"]
["Opmerkingen"]
["Zorg Informatie Bouwsteen (ZIB)","ZIB: Verrichting\nContainer (1): Indicatie::Probleem\nContainer (2):\nDataelement: ProbleemNaam\nOmzetting naar LROI:"]
["Voorbeeld","<instability>1</instability>"]
[]
["Terug naar Overzicht"]

{"sheet":"Instabiliteit","index":43,"n_rows":23,"n_cols":2,"rows_kept":23,"cut":false,"hidden":false,"merged":[]}
["DATA_ID",{"$f":"INDEX(Overzicht_unique!$A:$AJ, MATCH($B$2,Overzicht_unique!$A:$A,0), 36)","v":"LROI216"}]
["LROI uitvraag","Instabiliteit"]
["Variabelenaam XML","instability"]
["Variabelenaam database","rr_instability"]
["Label EN","Instability"]
["Label NL","Instabiliteit"]
["Definitie","Instabiliteit of dislocatie van de enkelprothese (bijvoorbeeld terugkerende luxatie en subluxatie)"]
["Doel / reden uitvraag","Inzicht in revisie-operaties en kwaliteit"]
["Waarde verplicht","Functioneel verplicht"]
["Datatype","Integer (INT)"]
["Domein (acceptabele range, min-max)"]
["Eenheid"]
["Format (max. lengte)"]
["Decimalen"]
["Codering (EN/NL)","0=No/ Nee\n1=Yes/ Ja"]
["Periode","Sinds start registratie"]
["Wijziging (datum en reden)"," Definitie gewijzigd in LROI-ingrepen v5.1; 01-01-2022. "]
["Noodzakelijk voor kwaliteitsindicatoren","Nee"]
["Opmerkingen"]
["Zorg Informatie Bouwsteen (ZIB)","ZIB: Verrichting\nContainer (1): Indicatie::Probleem\nContainer (2):\nDataelement: ProbleemNaam\nOmzetting naar LROI:"]
["Voorbeeld","<instability>1</instability>"]
[]
["Terug naar Overzicht"]

{"sheet":"Peri-articulaire ossificatie","index":44,"n_rows":23,"n_cols":2,"rows_kept":23,"cut":false,"hidden":false,"merged":[]}
["DATA_ID",{"$f":"INDEX(Overzicht_unique!$A:$AJ, MATCH($B$2,Overzicht_unique!$A:$A,0), 36)","v":"LROI027"}]
["LROI uitvraag","Peri-articulaire ossificatie"]
["Variabelenaam XML","periArticularOssification"]
["Variabelenaam database","rr_periartic_ossificat"]
["Label EN","Peri-articular ossification"]
["Label NL","Peri-articulaire ossificatie"]
["Definitie","Peri-articulaire (of heterotrope) ossificatie waarbij botmateriaal ontstaat in de weke delen van het lichaam"]
["Doel / reden uitvraag","Inzicht in revisie-operaties en kwaliteit"]
["Waarde verplicht","Functioneel verplicht"]
["Datatype","Integer (INT)"]
["Domein (acceptabele range, min-max)"]
["Eenheid"]
["Format (max. lengte)"]
["Decimalen"]
["Codering (EN/NL)","0=No/ Nee\n1=Yes/ Ja"]
["Periode","Sinds start registratie"]
["Wijziging (datum en reden)"]
["Noodzakelijk voor kwaliteitsindicatoren","Nee"]
["Opmerkingen"]
["Zorg Informatie Bouwsteen (ZIB)","ZIB: Verrichting\nContainer (1): Indicatie::Probleem\nContainer (2):\nDataelement: ProbleemNaam\nOmzetting naar LROI:"]
["Voorbeeld","<periArticularOssification>1</periArticularOssification>"]
[]
["Terug naar Overzicht"]

{"sheet":"Artrofibrose","index":45,"n_rows":23,"n_cols":2,"rows_kept":23,"cut":false,"hidden":false,"merged":[]}
["DATA_ID",{"$f":"INDEX(Overzicht_unique!$A:$AJ, MATCH($B$2,Overzicht_unique!$A:$A,0), 36)","v":"LROI119, LROI219"}]
["LROI uitvraag","Artrofibrose"]
["Variabelenaam XML","arthrofibrosis"]
["Variabelenaam database","rr_arthrofibrosis"]
["Label EN","Arthrofibrosis"]
["Label NL","Artrofibrose"]
["Definitie","Inflammatoire conditie die leidt tot overmatige productie van littekenweefsel in en rond de knie- of enkelprothese resulterend in verminderde beweging van de knie of enkel"]
["Doel / reden uitvraag","Inzicht in revisie-operaties en kwaliteit"]
["Waarde verplicht","Functioneel verplicht"]
["Datatype","Integer (INT)"]
["Domein (acceptabele range, min-max)"]
["Eenheid"]
["Format (max. lengte)"]
["Decimalen"]
["Codering (EN/NL)","0=No/ Nee\n1=Yes/ Ja"]
["Periode","Sinds versie: januari 1, 2016"]
["Wijziging (datum en reden)"]
["Noodzakelijk voor kwaliteitsindicatoren","Nee"]
["Opmerkingen"]
["Zorg Informatie Bouwsteen (ZIB)","ZIB: Verrichting\nContainer (1): Indicatie::Probleem\nContainer (2):\nDataelement: ProbleemNaam\nOmzetting naar LROI:"]
["Voorbeeld","<arthrofibrosis>1</arthrofibrosis>"]
[]
["Terug naar Overzicht"]

{"sheet":"Cuff artropathie","index":46,"n_rows":23,"n_cols":2,"rows_kept":23,"cut":false,"hidden":false,"merged":[]}
["DATA_ID",{"$f":"INDEX(Overzicht_unique!$A:$AJ, MATCH($B$2,Overzicht_unique!$A:$A,0), 36)","v":"LROI293"}]
["LROI uitvraag","Cuff artropathie"]
["Variabelenaam XML","cuffArthropathy"]
["Variabelenaam database","rr_cuff_arthropathy"]
["Label EN","Cuff arthropathy"]
["Label NL","Cuff artropathie"]
["Definitie","Artrose veroorzaakt door een chronisch massief rotator cuff defect"]
["Doel / reden uitvraag","Inzicht in revisie-operaties en kwaliteit"]
["Waarde verplicht","Functioneel verplicht"]
["Datatype","Integer (INT)"]
["Domein (acceptabele range, min-max)"]
["Eenheid"]
["Format (max. lengte)"]
["Decimalen"]
["Codering (EN/NL)","0=No/ Nee\n1=Yes/ Ja"]
["Periode","Sinds start registratie"]
["Wijziging (datum en reden)"]
["Noodzakelijk voor kwaliteitsindicatoren","Nee"]
["Opmerkingen"]
["Zorg Informatie Bouwsteen (ZIB)","ZIB: Verrichting\nContainer (1): Indicatie::Probleem\nContainer (2):\nDataelement: ProbleemNaam\nOmzetting naar LROI:"]
["Voorbeeld","<cuffArthropathy>1</cuffArthropathy>"]
[]
["Terug naar Overzicht"]

{"sheet":"Onherstelbare cuff ruptuur","index":47,"n_rows":23,"n_cols":2,"rows_kept":23,"cut":false,"hidden":false,"merged":[]}
["DATA_ID",{"$f":"INDEX(Overzicht_unique!$A:$AJ, MATCH($B$2,Overzicht_unique!$A:$A,0), 36)","v":"LROI294"}]
["LROI uitvraag","Onherstelbare cuff ruptuur"]
["Variabelenaam XML","cuffRupture"]
["Variabelenaam database","rr_cuff_rupture"]
["Label EN","Cuff rupture"]
["Label NL","Onherstelbare cuff ruptuur"]
["Definitie","Onherstelbare ruptuur van de rotator cuff"]
["Doel / reden uitvraag","Inzicht in revisie-operaties en kwaliteit"]
["Waarde verplicht","Functioneel verplicht"]
["Datatype","Integer (INT)"]
["Domein (acceptabele range, min-max)"]
["Eenheid"]
["Format (max. lengte)"]
["Decimalen"]
["Codering (EN/NL)","0=No/ Nee\n1=Yes/ Ja"]
["Periode","Sinds start registratie"]
["Wijziging (datum en reden)"]
["Noodzakelijk voor kwaliteitsindicatoren","Nee"]
["Opmerkingen"]
["Zorg Informatie Bouwsteen (ZIB)","ZIB: Verrichting\nContainer (1): Indicatie::Probleem\nContainer (2):\nDataelement: ProbleemNaam\nOmzetting naar LROI:"]
["Voorbeeld","<cuffRupture>1</cuffRupture>"]
[]
["Terug naar Overzicht"]

{"sheet":"Metallose","index":48,"n_rows":23,"n_cols":2,"rows_kept":23,"cut":false,"hidden":false,"merged":[]}
["DATA_ID",{"$f":"INDEX(Overzicht_unique!$A:$AJ, MATCH($B$2,Overzicht_unique!$A:$A,0), 36)","v":"LROI383"}]
["LROI uitvraag","Metallose"]
["Variabelenaam XML","metallosis"]
["Variabelenaam database","rr_metallosis"]
["Label EN","Metallosis"]
["Label NL","Metallose"]
["Definitie","Verwijdering van de prothese door depositie en opgestapelde metaaldeeltjes"]
["Doel / reden uitvraag","Inzicht in revisie-operaties en kwaliteit"]
["Waarde verplicht","Functioneel verplicht"]
["Datatype","Integer (INT)"]
["Domein (acceptabele range, min-max)"]
["Eenheid"]
["Format (max. lengte)"]
["Decimalen"]
["Codering (EN/NL)","0=No/ Nee\n1=Yes/ Ja"]
["Periode","Sinds start registratie"]
["Wijziging (datum en reden)"]
["Noodzakelijk voor kwaliteitsindicatoren","Nee"]
["Opmerkingen"]
["Zorg Informatie Bouwsteen (ZIB)","ZIB: Verrichting\nContainer (1): Indicatie::Probleem\nContainer (2):\nDataelement: ProbleemNaam\nOmzetting naar LROI:"]
["Voorbeeld","<metallosis>1</metallosis>"]
[]
["Terug naar Overzicht"]

{"sheet":"Implantaatbreuk","index":49,"n_rows":23,"n_cols":2,"rows_kept":23,"cut":false,"hidden":false,"merged":[]}
["DATA_ID",{"$f":"INDEX(Overzicht_unique!$A:$AJ, MATCH($B$2,Overzicht_unique!$A:$A,0), 36)","v":"LROI477, LROI575"}]
["LROI uitvraag","Implantaatbreuk"]
["Variabelenaam XML","implantBreakage"]
["Variabelenaam database","rr_implant_fracture"]
["Label EN","Implant breakage"]
["Label NL","Implantaatbreuk"]
["Definitie","Breuk van de pols- of duim/vingerprothese"]
["Doel / reden uitvraag","Inzicht in revisie-operaties en kwaliteit"]
["Waarde verplicht","Functioneel verplicht"]
["Datatype","Integer (INT)"]
["Domein (acceptabele range, min-max)"]
["Eenheid"]
["Format (max. lengte)"]
["Decimalen"]
["Codering (EN/NL)","0=No/ Nee\n1=Yes/ Ja"]
["Periode","Sinds start registratie"]
["Wijziging (datum en reden)"]
["Noodzakelijk voor kwaliteitsindicatoren","Nee"]
["Opmerkingen"]
["Zorg Informatie Bouwsteen (ZIB)","ZIB: Verrichting\nContainer (1): Indicatie::Probleem\nContainer (2):\nDataelement: ProbleemNaam\nOmzetting naar LROI:"]
["Voorbeeld","<implantBreakage>1</implantBreakage>"]
[]
["Terug naar Overzicht"]

{"sheet":"Loslating acetabulumcomponent","index":50,"n_rows":23,"n_cols":2,"rows_kept":23,"cut":false,"hidden":false,"merged":[]}
["DATA_ID",{"$f":"INDEX(Overzicht_unique!$A:$AJ, MATCH($B$2,Overzicht_unique!$A:$A,0), 36)","v":"LROI028"}]
["LROI uitvraag","Loslating acetabulumcomponent"]
["Variabelenaam XML","looseningAcetabularComponent"]
["Variabelenaam database","rr_loose_acetabulum"]
["Label EN","Loosening acetabular component"]
["Label NL","Loslating acetabulumcomponent"]
["Definitie","Loslaten van de acetabulumcomponent ongeacht de reden (inclusief protrusio)"]
["Doel / reden uitvraag","Inzicht in revisie-operaties en kwaliteit"]
["Waarde verplicht","Functioneel verplicht"]
["Datatype","Integer (INT)"]
["Domein (acceptabele range, min-max)"]
["Eenheid"]
["Format (max. lengte)"]
["Decimalen"]
["Codering (EN/NL)","0=No/ Nee\n1=Yes/ Ja"]
["Periode","Sinds start registratie"]
["Wijziging (datum en reden)"]
["Noodzakelijk voor kwaliteitsindicatoren","Nee"]
["Opmerkingen"]
["Zorg Informatie Bouwsteen (ZIB)","ZIB: Verrichting\nContainer (1): Indicatie::Probleem\nContainer (2):\nDataelement: ProbleemNaam\nOmzetting naar LROI:"]
["Voorbeeld","<looseningAcetabularComponent>1</looseningAcetabularComponent>"]
[]
["Terug naar Overzicht"]

{"sheet":"Loslating femurcomponent","index":51,"n_rows":23,"n_cols":2,"rows_kept":23,"cut":false,"hidden":false,"merged":[]}
["DATA_ID",{"$f":"INDEX(Overzicht_unique!$A:$AJ, MATCH($B$2,Overzicht_unique!$A:$A,0), 36)","v":"LROI029, LROI120"}]
["LROI uitvraag","Loslating femurcomponent"]
["Variabelenaam XML","looseningFemoralComponent"]
["Variabelenaam database","rr_loose_femur"]
["Label EN","Loosening femoral component"]
["Label NL","Loslating femurcomponent"]
["Definitie"," Loslaten van de femurcomponent ongeacht de reden"]
["Doel / reden uitvraag","Inzicht in revisie-operaties en kwaliteit"]
["Waarde verplicht","Functioneel verplicht"]
["Datatype","Integer (INT)"]
["Domein (acceptabele range, min-max)"]
["Eenheid"]
["Format (max. lengte)"]
["Decimalen"]
["Codering (EN/NL)","0=No/ Nee\n1=Yes/ Ja"]
["Periode","Sinds start registratie"]
["Wijziging (datum en reden)"]
["Noodzakelijk voor kwaliteitsindicatoren","Nee"]
["Opmerkingen"]
["Zorg Informatie Bouwsteen (ZIB)","ZIB: Verrichting\nContainer (1): Indicatie::Probleem\nContainer (2):\nDataelement: ProbleemNaam\nOmzetting naar LROI:"]
["Voorbeeld","<looseningFemoralComponent>1</looseningFemoralComponent>"]
[]
["Terug naar Overzicht"]

{"sheet":"Loslating tibiacomponent","index":52,"n_rows":23,"n_cols":2,"rows_kept":23,"cut":false,"hidden":false,"merged":[]}
["DATA_ID",{"$f":"INDEX(Overzicht_unique!$A:$AJ, MATCH($B$2,Overzicht_unique!$A:$A,0), 36)","v":"LROI121, LROI217"}]
["LROI uitvraag","Loslating tibiacomponent"]
["Variabelenaam XML","looseningTibialComponent"]
["Variabelenaam database","rr_loose_tibia"]
["Label EN","Loosening tibia component"]
["Label NL","Loslating tibiacomponent"]
["Definitie","Loslaten van de tibiacomponent ongeacht de reden"]
["Doel / reden uitvraag","Inzicht in revisie-operaties en kwaliteit"]
["Waarde verplicht","Functioneel verplicht"]
["Datatype","Integer (INT)"]
["Domein (acceptabele range, min-max)"]
["Eenheid"]
["Format (max. lengte)"]
["Decimalen"]
["Codering (EN/NL)","0=No/ Nee\n1=Yes/ Ja"]
["Periode","Sinds start registratie"]
["Wijziging (datum en reden)"]
["Noodzakelijk voor kwaliteitsindicatoren","Nee"]
["Opmerkingen"]
["Zorg Informatie Bouwsteen (ZIB)","ZIB: Verrichting\nContainer (1): Indicatie::Probleem\nContainer (2):\nDataelement: ProbleemNaam\nOmzetting naar LROI:"]
["Voorbeeld","<looseningTibialComponent>1</looseningTibialComponent>"]
[]
["Terug naar Overzicht"]

{"sheet":"Loslating patellacomponent","index":53,"n_rows":23,"n_cols":2,"rows_kept":23,"cut":false,"hidden":false,"merged":[]}
["DATA_ID",{"$f":"INDEX(Overzicht_unique!$A:$AJ, MATCH($B$2,Overzicht_unique!$A:$A,0), 36)","v":"LROI122"}]
["LROI uitvraag","Loslating patellacomponent"]
["Variabelenaam XML","looseningPatellarComponent"]
["Variabelenaam database","rr_loose_patella"]
["Label EN","Loosening of patellar component"]
["Label NL","Loslating patellacomponent"]
["Definitie","Loslaten van de patellacomponent ongeacht de reden"]
["Doel / reden uitvraag","Inzicht in revisie-operaties en kwaliteit"]
["Waarde verplicht","Functioneel verplicht"]
["Datatype","Integer (INT)"]
["Domein (acceptabele range, min-max)"]
["Eenheid"]
["Format (max. lengte)"]
["Decimalen"]
["Codering (EN/NL)","0=No/ Nee\n1=Yes/ Ja"]
["Periode","Sinds start registratie"]
["Wijziging (datum en reden)"]
["Noodzakelijk voor kwaliteitsindicatoren","Nee"]
["Opmerkingen"]
["Zorg Informatie Bouwsteen (ZIB)","ZIB: Verrichting\nContainer (1): Indicatie::Probleem\nContainer (2):\nDataelement: ProbleemNaam\nOmzetting naar LROI:"]
["Voorbeeld","<looseningPatellarComponent>1</looseningPatellarComponent>"]
[]
["Terug naar Overzicht"]

{"sheet":"Loslating taluscomponent","index":54,"n_rows":23,"n_cols":2,"rows_kept":23,"cut":false,"hidden":false,"merged":[]}
["DATA_ID",{"$f":"INDEX(Overzicht_unique!$A:$AJ, MATCH($B$2,Overzicht_unique!$A:$A,0), 36)","v":"LROI218"}]
["LROI uitvraag","Loslating taluscomponent"]
["Variabelenaam XML","looseningTalusComponent"]
["Variabelenaam database","rr_loose_talus"]
["Label EN","Loosening talus component"]
["Label NL","Loslating taluscomponent"]
["Definitie","Loslaten van de taluscomponent ongeacht de reden"]
["Doel / reden uitvraag","Inzicht in revisie-operaties en kwaliteit"]
["Waarde verplicht","Functioneel verplicht"]
["Datatype","Integer (INT)"]
["Domein (acceptabele range, min-max)"]
["Eenheid"]
["Format (max. lengte)"]
["Decimalen"]
["Codering (EN/NL)","0=No/ Nee\n1=Yes/ Ja"]
["Periode","Sinds start registratie"]
["Wijziging (datum en reden)"]
["Noodzakelijk voor kwaliteitsindicatoren","Nee"]
["Opmerkingen"]
["Zorg Informatie Bouwsteen (ZIB)","ZIB: Verrichting\nContainer (1): Indicatie::Probleem\nContainer (2):\nDataelement: ProbleemNaam\nOmzetting naar LROI:"]
["Voorbeeld","<looseningTalusComponent>1</looseningTalusComponent>"]
[]
["Terug naar Overzicht"]

{"sheet":"Loslating humeruscomponent","index":55,"n_rows":23,"n_cols":2,"rows_kept":23,"cut":false,"hidden":false,"merged":[]}
["DATA_ID",{"$f":"INDEX(Overzicht_unique!$A:$AJ, MATCH($B$2,Overzicht_unique!$A:$A,0), 36)","v":"LROI295, LROI384"}]
["LROI uitvraag","Loslating humeruscomponent"]
["Variabelenaam XML","looseningHumeralComponent"]
["Variabelenaam database","rr_loose_humeralstem"]
["Label EN","Loosening humeral component"]
["Label NL","Loslating humeruscomponent"]
["Definitie","Loslaten van de humeruscomponent ongeacht de reden"]
["Doel / reden uitvraag","Inzicht in revisie-operaties en kwaliteit"]
["Waarde verplicht","Functioneel verplicht"]
["Datatype","Integer (INT)"]
["Domein (acceptabele range, min-max)"]
["Eenheid"]
["Format (max. lengte)"]
["Decimalen"]
["Codering (EN/NL)","0=No/ Nee\n1=Yes/ Ja"]
["Periode","Sinds start registratie"]
["Wijziging (datum en reden)"]
["Noodzakelijk voor kwaliteitsindicatoren","Nee"]
["Opmerkingen"]
["Zorg Informatie Bouwsteen (ZIB)","ZIB: Verrichting\nContainer (1): Indicatie::Probleem\nContainer (2):\nDataelement: ProbleemNaam\nOmzetting naar LROI:"]
["Voorbeeld","<looseningHumeralComponent>1</looseningHumeralComponent>"]
[]
["Terug naar Overzicht"]

{"sheet":"Loslating glenoïdcomponent","index":56,"n_rows":23,"n_cols":2,"rows_kept":23,"cut":false,"hidden":false,"merged":[]}
["DATA_ID",{"$f":"INDEX(Overzicht_unique!$A:$AJ, MATCH($B$2,Overzicht_unique!$A:$A,0), 36)","v":"LROI296"}]
["LROI uitvraag","Loslating glenoïdcomponent"]
["Variabelenaam XML","looseningGlenoidComponent"]
["Variabelenaam database","rr_loose_glen"]
["Label EN","Loosening glenoid component"]
["Label NL","Loslating glenoïdcomponent"]
["Definitie","Loslaten van de glenoïdcomponent ongeacht de reden"]
["Doel / reden uitvraag","Inzicht in revisie-operaties en kwaliteit"]
["Waarde verplicht","Functioneel verplicht"]
["Datatype","Integer (INT)"]
["Domein (acceptabele range, min-max)"]
["Eenheid"]
["Format (max. lengte)"]
["Decimalen"]
["Codering (EN/NL)","0=No/ Nee\n1=Yes/ Ja"]
["Periode","Sinds start registratie"]
["Wijziging (datum en reden)"]
["Noodzakelijk voor kwaliteitsindicatoren","Nee"]
["Opmerkingen"]
["Zorg Informatie Bouwsteen (ZIB)","ZIB: Verrichting\nContainer (1): Indicatie::Probleem\nContainer (2):\nDataelement: ProbleemNaam\nOmzetting naar LROI:"]
["Voorbeeld","<looseningGlenoidComponent>1</looseningGlenoidComponent>"]
[]
["Terug naar Overzicht"]

{"sheet":"Loslating ulnacomponent","index":57,"n_rows":23,"n_cols":2,"rows_kept":23,"cut":false,"hidden":false,"merged":[]}
["DATA_ID",{"$f":"INDEX(Overzicht_unique!$A:$AJ, MATCH($B$2,Overzicht_unique!$A:$A,0), 36)","v":"LROI385, LROI479"}]
["LROI uitvraag","Loslating ulnacomponent"]
["Variabelenaam XML","looseningUlnarComponent"]
["Variabelenaam database","rr_loose_ulna"]
["Label EN","Loosening ulnar component"]
["Label NL","Loslating ulnacomponent"]
["Definitie","Loslaten van de ulnacomponent ongeacht de reden"]
["Doel / reden uitvraag","Inzicht in revisie-operaties en kwaliteit"]
["Waarde verplicht","Functioneel verplicht"]
["Datatype","Integer (INT)"]
["Domein (acceptabele range, min-max)"]
["Eenheid"]
["Format (max. lengte)"]
["Decimalen"]
["Codering (EN/NL)","0=No/ Nee\n1=Yes/ Ja"]
["Periode","Sinds start registratie"]
["Wijziging (datum en reden)"]
["Noodzakelijk voor kwaliteitsindicatoren","Nee"]
["Opmerkingen"]
["Zorg Informatie Bouwsteen (ZIB)","ZIB: Verrichting\nContainer (1): Indicatie::Probleem\nContainer (2):\nDataelement: ProbleemNaam\nOmzetting naar LROI:"]
["Voorbeeld","<looseningUlnarComponent>1</looseningUlnarComponent>"]
[]
["Terug naar Overzicht"]

{"sheet":"Loslating radiuscomponent","index":58,"n_rows":23,"n_cols":2,"rows_kept":23,"cut":false,"hidden":false,"merged":[]}
["DATA_ID",{"$f":"INDEX(Overzicht_unique!$A:$AJ, MATCH($B$2,Overzicht_unique!$A:$A,0), 36)","v":"LROI478"}]
["LROI uitvraag","Loslating radiuscomponent"]
["Variabelenaam XML","looseningRadialComponent"]
["Variabelenaam database","rr_loose_radius"]
["Label EN","Loosening radius component"]
["Label NL","Loslating radiuscomponent"]
["Definitie","Loslaten van de radiuscomponent ongeacht de reden"]
["Doel / reden uitvraag","Inzicht in revisie-operaties en kwaliteit"]
["Waarde verplicht","Functioneel verplicht"]
["Datatype","Integer (INT)"]
["Domein (acceptabele range, min-max)"]
["Eenheid"]
["Format (max. lengte)"]
["Decimalen"]
["Codering (EN/NL)","0=No/ Nee\n1=Yes/ Ja"]
["Periode","Sinds start registratie"]
["Wijziging (datum en reden)"]
["Noodzakelijk voor kwaliteitsindicatoren","Nee"]
["Opmerkingen"]
["Zorg Informatie Bouwsteen (ZIB)","ZIB: Verrichting\nContainer (1): Indicatie::Probleem\nContainer (2):\nDataelement: ProbleemNaam\nOmzetting naar LROI:"]
["Voorbeeld","<looseningRadialComponent>1</looseningRadialComponent>"]
[]
["Terug naar Overzicht"]

{"sheet":"Loslating carpaalcomponent","index":59,"n_rows":23,"n_cols":2,"rows_kept":23,"cut":false,"hidden":false,"merged":[]}
["DATA_ID",{"$f":"INDEX(Overzicht_unique!$A:$AJ, MATCH($B$2,Overzicht_unique!$A:$A,0), 36)","v":"LROI480"}]
["LROI uitvraag","Loslating carpaalcomponent"]
["Variabelenaam XML","looseningCarpalComponent "]
["Variabelenaam database","rr_loose_carpals"]
["Label EN","Loosening carpal component"]
["Label NL","Loslating carpaalcomponent"]
["Definitie","Loslaten van de carpaalcomponent ongeacht de reden"]
["Doel / reden uitvraag","Inzicht in revisie-operaties en kwaliteit"]
["Waarde verplicht","Functioneel verplicht"]
["Datatype","Integer (INT)"]
["Domein (acceptabele range, min-max)"]
["Eenheid"]
["Format (max. lengte)"]
["Decimalen"]
["Codering (EN/NL)","0=No/ Nee\n1=Yes/ Ja"]
["Periode","Sinds start registratie"]
["Wijziging (datum en reden)"]
["Noodzakelijk voor kwaliteitsindicatoren","Nee"]
["Opmerkingen"]
["Zorg Informatie Bouwsteen (ZIB)","ZIB: Verrichting\nContainer (1): Indicatie::Probleem\nContainer (2):\nDataelement: ProbleemNaam\nOmzetting naar LROI:"]
["Voorbeeld","<looseningCarpalComponent>1</looseningCarpalComponent>"]
[]
["Terug naar Overzicht"]

{"sheet":"Loslating proximale component","index":60,"n_rows":23,"n_cols":2,"rows_kept":23,"cut":false,"hidden":false,"merged":[]}
["DATA_ID",{"$f":"INDEX(Overzicht_unique!$A:$AJ, MATCH($B$2,Overzicht_unique!$A:$A,0), 36)","v":"LROI576"}]
["LROI uitvraag","Loslating proximale component"]
["Variabelenaam XML","looseningProximalComponent"]
["Variabelenaam database","rr_loose_prox_comp"]
["Label EN","Loosening proximal component"]
["Label NL","Loslating proximale component"]
["Definitie","Loslaten van de proximale component ongeacht de reden"]
["Doel / reden uitvraag","Inzicht in revisie-operaties en kwaliteit"]
["Waarde verplicht","Functioneel verplicht"]
["Datatype","Integer (INT)"]
["Domein (acceptabele range, min-max)"]
["Eenheid"]
["Format (max. lengte)"]
["Decimalen"]
["Codering (EN/NL)","0=No/ Nee\n1=Yes/ Ja"]
["Periode","Sinds start registratie"]
["Wijziging (datum en reden)"]
["Noodzakelijk voor kwaliteitsindicatoren","Nee"]
["Opmerkingen"]
["Zorg Informatie Bouwsteen (ZIB)","ZIB: Verrichting\nContainer (1): Indicatie::Probleem\nContainer (2):\nDataelement: ProbleemNaam\nOmzetting naar LROI:"]
["Voorbeeld","<looseningProximalComponent>1</looseningProximalComponent>"]
[]
["Terug naar Overzicht"]

{"sheet":"Loslating distale component","index":61,"n_rows":23,"n_cols":2,"rows_kept":23,"cut":false,"hidden":false,"merged":[]}
["DATA_ID",{"$f":"INDEX(Overzicht_unique!$A:$AJ, MATCH($B$2,Overzicht_unique!$A:$A,0), 36)","v":"LROI577"}]
["LROI uitvraag","Loslating distale component"]
["Variabelenaam XML","looseningDistalComponent"]
["Variabelenaam database","rr_loose_dist_comp"]
["Label EN","Loosening distal component"]
["Label NL","Loslating distale component"]
["Definitie","Loslaten van de distale component ongeacht de reden"]
["Doel / reden uitvraag","Inzicht in revisie-operaties en kwaliteit"]
["Waarde verplicht","Functioneel verplicht"]
["Datatype","Integer (INT)"]
["Domein (acceptabele range, min-max)"]
["Eenheid"]
["Format (max. lengte)"]
["Decimalen"]
["Codering (EN/NL)","0=No/ Nee\n1=Yes/ Ja"]
["Periode","Sinds start registratie"]
["Wijziging (datum en reden)"]
["Noodzakelijk voor kwaliteitsindicatoren","Nee"]
["Opmerkingen"]
["Zorg Informatie Bouwsteen (ZIB)","ZIB: Verrichting\nContainer (1): Indicatie::Probleem\nContainer (2):\nDataelement: ProbleemNaam\nOmzetting naar LROI:"]
["Voorbeeld","<looseningDistalComponent>1</looseningDistalComponent>"]
[]
["Terug naar Overzicht"]

{"sheet":"Symptomatische MoM articulatie","index":62,"n_rows":23,"n_cols":2,"rows_kept":23,"cut":false,"hidden":false,"merged":[]}
["DATA_ID",{"$f":"INDEX(Overzicht_unique!$A:$AJ, MATCH($B$2,Overzicht_unique!$A:$A,0), 36)","v":"LROI030"}]
["LROI uitvraag","Symptomatische MoM articulatie"]
["Variabelenaam XML","symptomaticMomBearing"]
["Variabelenaam database","rr_symptomatic_mom"]
["Label EN","Symptomatic MoM bearing"]
["Label NL","Symptomatische MoM articulatie"]
["Definitie","Metaal-op-metaal gerelateerde reacties zoals pseudotumor, negatieve reacties op metaaldeeltjes (ARMD), hoge bloedwaarden met metaalionen of aseptische "]
["Doel / reden uitvraag","Inzicht in revisie-operaties en kwaliteit"]
["Waarde verplicht","Functioneel verplicht"]
["Datatype","Integer (INT)"]
["Domein (acceptabele range, min-max)"]
["Eenheid"]
["Format (max. lengte)"]
["Decimalen"]
["Codering (EN/NL)","0=No/ Nee\n1=Yes/ Ja"]
["Periode","Sinds versie januari 1, 2013"]
["Wijziging (datum en reden)"]
["Noodzakelijk voor kwaliteitsindicatoren","Nee"]
["Opmerkingen"]
["Zorg Informatie Bouwsteen (ZIB)","ZIB: Verrichting\nContainer (1): Indicatie::Probleem\nContainer (2):\nDataelement: ProbleemNaam\nOmzetting naar LROI:"]
["Voorbeeld","<symptomaticMomBearing>1</symptomaticMomBearing>"]
[]
["Terug naar Overzicht"]

{"sheet":"Progressie van artrose (partiël","index":63,"n_rows":23,"n_cols":2,"rows_kept":23,"cut":false,"hidden":false,"merged":[]}
["DATA_ID",{"$f":"INDEX(Overzicht_unique!$A:$AJ, MATCH($B$2,Overzicht_unique!$A:$A,0), 36)","v":"LROI123"}]
["LROI uitvraag","Progressie van artrose (partiële knieprothese)"]
["Variabelenaam XML","progressionOsteoarthritis"]
["Variabelenaam database","rr_progr_osteoarthr"]
["Label EN","Progression of osteoarthritis (partial knee prosthesis)"]
["Label NL","Progressie van artrose (partiële knieprothese)"]
["Definitie","Progressie van artrose bij patiënten met een unicondylaire of patellofemorale knieprothese met plaatsing van een totale knieprothese als gevolg"]
["Doel / reden uitvraag","Inzicht in revisie-operaties en kwaliteit"]
["Waarde verplicht","Functioneel verplicht"]
["Datatype","Integer (INT)"]
["Domein (acceptabele range, min-max)"]
["Eenheid"]
["Format (max. lengte)"]
["Decimalen"]
["Codering (EN/NL)","0=No/ Nee\n1=Yes/ Ja"]
["Periode","Sinds start registratie"]
["Wijziging (datum en reden)","Term gewijzigd (voorheen \"Progressie van artrose (unicondylair)\") in LROI-ingrepen v5.1; 01-01-2022. Hier vallen de patellofemorale knieprotheses buiten. Als je de term breder pakt (partiele knieprothese) dan kan die er ook in vallen."]
["Noodzakelijk voor kwaliteitsindicatoren","Nee"]
["Opmerkingen"]
["Zorg Informatie Bouwsteen (ZIB)","ZIB: Verrichting\nContainer (1): Indicatie::Probleem\nContainer (2):\nDataelement: ProbleemNaam\nOmzetting naar LROI:"]
["Voorbeeld","<progressionOsteoarthritis>1</progressionOsteoarthritis>"]
[]
["Terug naar Overzicht"]

{"sheet":"Progressie van glenoïd artrose","index":64,"n_rows":23,"n_cols":2,"rows_kept":23,"cut":false,"hidden":false,"merged":[]}
["DATA_ID",{"$f":"INDEX(Overzicht_unique!$A:$AJ, MATCH($B$2,Overzicht_unique!$A:$A,0), 36)","v":"LROI297"}]
["LROI uitvraag","Progressie van glenoïd artrose"]
["Variabelenaam XML","progressionGlenoidOsteoarthritis"]
["Variabelenaam database","rr_prog_glen_osteoarthr"]
["Label EN","Progression of glenoid osteoarthritis"]
["Label NL","Progressie van glenoïd artrose"]
["Definitie","Progressie van artrose met revisie van de eerder geplaatste prothese als gevolg"]
["Doel / reden uitvraag","Inzicht in revisie-operaties en kwaliteit"]
["Waarde verplicht","Functioneel verplicht"]
["Datatype","Integer (INT)"]
["Domein (acceptabele range, min-max)"]
["Eenheid"]
["Format (max. lengte)"]
["Decimalen"]
["Codering (EN/NL)","0=No/ Nee\n1=Yes/ Ja"]
["Periode","Sinds start registratie"]
["Wijziging (datum en reden)"]
["Noodzakelijk voor kwaliteitsindicatoren","Nee"]
["Opmerkingen"]
["Zorg Informatie Bouwsteen (ZIB)","ZIB: Verrichting\nContainer (1): Indicatie::Probleem\nContainer (2):\nDataelement: ProbleemNaam\nOmzetting naar LROI:"]
["Voorbeeld","<progressionGlenoidOsteoarthritis>1</progressionGlenoidOsteoarthritis>"]
[]
["Terug naar Overzicht"]

{"sheet":"Pijn","index":65,"n_rows":23,"n_cols":2,"rows_kept":23,"cut":false,"hidden":false,"merged":[]}
["DATA_ID",{"$f":"INDEX(Overzicht_unique!$A:$AJ, MATCH($B$2,Overzicht_unique!$A:$A,0), 36)","v":"LROI125"}]
["LROI uitvraag","Pijn"]
["Variabelenaam XML","pain"]
["Variabelenaam database","rr_patellar_pain"]
["Label EN","Pain"]
["Label NL","Pijn"]
["Definitie","Pijn door gewrichtprothese"]
["Doel / reden uitvraag","Inzicht in revisie-operaties en kwaliteit"]
["Waarde verplicht","Functioneel verplicht"]
["Datatype","Integer (INT)"]
["Domein (acceptabele range, min-max)"]
["Eenheid"]
["Format (max. lengte)"]
["Decimalen"]
["Codering (EN/NL)","0=No/ Nee\n1=Yes/ Ja"]
["Periode","Sinds start registratie"]
["Wijziging (datum en reden)","Term gewijzigd (voorheen \"Patellaire pijn\") in LROI-ingrepen v5.1; 01-01-2022. Een aanzienlijk deel van de uni’s worden voor pijn gereviseerd. Deze zouden een minder goede uitkomst qua PROMS en heroperaties hebben. Dit betreft niet alleen patellaire pijn. Ik zou dus “patellaire” weglaten en de term iets breder nemen om ook deze te kunnen includeren."]
["Noodzakelijk voor kwaliteitsindicatoren","Nee"]
["Opmerkingen"]
["Zorg Informatie Bouwsteen (ZIB)","ZIB: Verrichting\nContainer (1): Indicatie::Probleem\nContainer (2):\nDataelement: ProbleemNaam\nOmzetting naar LROI:"]
["Voorbeeld","<pain>1</pain>"]
[]
["Terug naar Overzicht"]

{"sheet":"Cystevorming","index":66,"n_rows":23,"n_cols":2,"rows_kept":23,"cut":false,"hidden":false,"merged":[]}
["DATA_ID",{"$f":"INDEX(Overzicht_unique!$A:$AJ, MATCH($B$2,Overzicht_unique!$A:$A,0), 36)","v":"LROI220"}]
["LROI uitvraag","Cystevorming"]
["Variabelenaam XML","cysteFormation"]
["Variabelenaam database","rr_cyst_formation"]
["Label EN","Cyste formation"]
["Label NL","Cystevorming"]
["Definitie","Toenemende osteolytische cystevorming aangrenzend aan de enkelprothese"]
["Doel / reden uitvraag","Inzicht in revisie-operaties en kwaliteit"]
["Waarde verplicht","Functioneel verplicht"]
["Datatype","Integer (INT)"]
["Domein (acceptabele range, min-max)"]
["Eenheid"]
["Format (max. lengte)"]
["Decimalen"]
["Codering (EN/NL)","0=No/ Nee\n1=Yes/ Ja"]
["Periode","Sinds start registratie"]
["Wijziging (datum en reden)"]
["Noodzakelijk voor kwaliteitsindicatoren","Nee"]
["Opmerkingen"]
["Zorg Informatie Bouwsteen (ZIB)","ZIB: Verrichting\nContainer (1): Indicatie::Probleem\nContainer (2):\nDataelement: ProbleemNaam\nOmzetting naar LROI:"]
["Voorbeeld","<cysteFormation>1</cysteFormation>"]
[]
["Terug naar Overzicht"]

{"sheet":"Mechanische complicatie radiusk","index":67,"n_rows":23,"n_cols":2,"rows_kept":23,"cut":false,"hidden":false,"merged":[]}
["DATA_ID",{"$f":"INDEX(Overzicht_unique!$A:$AJ, MATCH($B$2,Overzicht_unique!$A:$A,0), 36)","v":"LROI386"}]
["LROI uitvraag","Mechanische complicatie radiuskopprothese"]
["Variabelenaam XML","mechComplRadialHead"]
["Variabelenaam database","rr_loose_radius"]
["Label EN","Mechanical complication radial head prosthesis"]
["Label NL","Mechanische complicatie radiuskopprothese"]
["Definitie","Mechanische complicatie radiuskopprothese ongeacht de reden (bijvoorbeeld kraakbeenschade capitellum, acute of chronische (sub) luxatie, overstuffing)"]
["Doel / reden uitvraag","Inzicht in revisie-operaties en kwaliteit"]
["Waarde verplicht","Functioneel verplicht"]
["Datatype","Integer (INT)"]
["Domein (acceptabele range, min-max)"]
["Eenheid"]
["Format (max. lengte)"]
["Decimalen"]
["Codering (EN/NL)","0=No/ Nee\n1=Yes/ Ja"]
["Periode","Sinds start registratie; term gewijzigd (voorheen \"Loslating radiuscomponent\") in LROI-ingrepen v5.1; 01-01-2022"]
["Wijziging (datum en reden)","Loslating van de radius component dekt de lading niet. Advies is verwijderen loslating radiuscomponent en toevoegen Mechanische complicatie radiuskopprothese."]
["Noodzakelijk voor kwaliteitsindicatoren","Nee"]
["Opmerkingen"]
["Zorg Informatie Bouwsteen (ZIB)","ZIB: Verrichting\nContainer (1): Indicatie::Probleem\nContainer (2):\nDataelement: ProbleemNaam\nOmzetting naar LROI:"]
["Voorbeeld","<mechComplRadialHead>1</mechComplRadialHead>"]
[]
["Terug naar Overzicht"]

{"sheet":"Botresorptie rondom radiuscompo","index":68,"n_rows":23,"n_cols":2,"rows_kept":23,"cut":false,"hidden":false,"merged":[]}
["DATA_ID",{"$f":"INDEX(Overzicht_unique!$A:$AJ, MATCH($B$2,Overzicht_unique!$A:$A,0), 36)","v":"LROI481"}]
["LROI uitvraag","Botresorptie rondom radiuscomponent"]
["Variabelenaam XML","boneResorptionRadialComp"]
["Variabelenaam database","rr_bone_resorption_radius"]
["Label EN","Bone resorption around radius component"]
["Label NL","Botresorptie rondom radiuscomponent"]
["Definitie","Botverlies rondom de radiuscomponent ongeacht de reden"]
["Doel / reden uitvraag","Inzicht in revisie-operaties en kwaliteit"]
["Waarde verplicht","Functioneel verplicht"]
["Datatype","Integer (INT)"]
["Domein (acceptabele range, min-max)"]
["Eenheid"]
["Format (max. lengte)"]
["Decimalen"]
["Codering (EN/NL)","0=No/ Nee\n1=Yes/ Ja"]
["Periode","Sinds start registratie en gewijzigd in LROI-ingrepen v5.1; 01-01-2022"]
["Wijziging (datum en reden)","Term gewijzigd (voorheen \"Lysis van componenten\") in LROI-ingrepen v5.1; 01-01-2022. “Lysis” aanpassen naar “botresorptie”, overeenkomstig met Vingerformulier. “Componenten” opgedeeld naar specifieke componenttypen, zoals bij Vinger."]
["Noodzakelijk voor kwaliteitsindicatoren","Nee"]
["Opmerkingen"]
["Zorg Informatie Bouwsteen (ZIB)","ZIB: Verrichting\nContainer (1): Indicatie::Probleem\nContainer (2):\nDataelement: ProbleemNaam\nOmzetting naar LROI:"]
["Voorbeeld","<boneResorptionRadialComp>1</boneResorptionRadialComp>"]
[]
["Terug naar Overzicht"]

{"sheet":"Botresorptie rondom ulnacompone","index":69,"n_rows":23,"n_cols":2,"rows_kept":23,"cut":false,"hidden":false,"merged":[]}
["DATA_ID",{"$f":"INDEX(Overzicht_unique!$A:$AJ, MATCH($B$2,Overzicht_unique!$A:$A,0), 36)","v":"LROI482"}]
["LROI uitvraag","Botresorptie rondom ulnacomponent"]
["Variabelenaam XML","boneResorptionUlnarComp"]
["Variabelenaam database","rr_bone_resorption_ulna"]
["Label EN","Bone resorption around ulna component"]
["Label NL","Botresorptie rondom ulnacomponent"]
["Definitie","Botverlies rondom de ulnacomponent ongeacht de reden"]
["Doel / reden uitvraag","Inzicht in revisie-operaties en kwaliteit"]
["Waarde verplicht","Functioneel verplicht"]
["Datatype","Integer (INT)"]
["Domein (acceptabele range, min-max)"]
["Eenheid"]
["Format (max. lengte)"]
["Decimalen"]
["Codering (EN/NL)","0=No/ Nee\n1=Yes/ Ja"]
["Periode","Sinds start registratie en gewijzigd in LROI-ingrepen v5.1; 01-01-2022"]
["Wijziging (datum en reden)","Term gewijzigd (voorheen \"Lysis van componenten\") in LROI-ingrepen v5.1; 01-01-2022. “Lysis” aanpassen naar “botresorptie”, overeenkomstig met Vingerformulier. “Componenten” opgedeeld naar specifieke componenttypen, zoals bij Vinger."]
["Noodzakelijk voor kwaliteitsindicatoren","Nee"]
["Opmerkingen"]
["Zorg Informatie Bouwsteen (ZIB)","ZIB: Verrichting\nContainer (1): Indicatie::Probleem\nContainer (2):\nDataelement: ProbleemNaam\nOmzetting naar LROI:"]
["Voorbeeld","<boneResorptionUlnarComp>1</boneResorptionUlnarComp>"]
[]
["Terug naar Overzicht"]

{"sheet":"Botresorptie rondom carpaalcomp","index":70,"n_rows":23,"n_cols":2,"rows_kept":23,"cut":false,"hidden":false,"merged":[]}
["DATA_ID",{"$f":"INDEX(Overzicht_unique!$A:$AJ, MATCH($B$2,Overzicht_unique!$A:$A,0), 36)","v":"LROI483"}]
["LROI uitvraag","Botresorptie rondom carpaalcomponent"]
["Variabelenaam XML","boneResorptionCarpalComp"]
["Variabelenaam database","rr_bone_resorption_carpus"]
["Label EN","Bone resorption around carpal component"]
["Label NL","Botresorptie rondom carpaalcomponent"]
["Definitie","Botverlies rondom de carpaalcomponent ongeacht de reden"]
["Doel / reden uitvraag","Inzicht in revisie-operaties en kwaliteit"]
["Waarde verplicht","Functioneel verplicht"]
["Datatype","Integer (INT)"]
["Domein (acceptabele range, min-max)"]
["Eenheid"]
["Format (max. lengte)"]
["Decimalen"]
["Codering (EN/NL)","0=No/ Nee\n1=Yes/ Ja"]
["Periode","Sinds start registratie en gewijzigd in LROI-ingrepen v5.1; 01-01-2022"]
["Wijziging (datum en reden)","Term gewijzigd (voorheen \"Lysis van componenten\") in LROI-ingrepen v5.1; 01-01-2022. “Lysis” aanpassen naar “botresorptie”, overeenkomstig met Vingerformulier. “Componenten” opgedeeld naar specifieke componenttypen, zoals bij Vinger."]
["Noodzakelijk voor kwaliteitsindicatoren","Nee"]
["Opmerkingen"]
["Zorg Informatie Bouwsteen (ZIB)","ZIB: Verrichting\nContainer (1): Indicatie::Probleem\nContainer (2):\nDataelement: ProbleemNaam\nOmzetting naar LROI:"]
["Voorbeeld","<boneResorptionCarpalComp>1</boneResorptionCarpalComp>"]
[]
["Terug naar Overzicht"]

{"sheet":"Botresorptie rondom proxi comp","index":71,"n_rows":23,"n_cols":2,"rows_kept":23,"cut":false,"hidden":false,"merged":[]}
["DATA_ID",{"$f":"INDEX(Overzicht_unique!$A:$AJ, MATCH($B$2,Overzicht_unique!$A:$A,0), 36)","v":"LROI578"}]
["LROI uitvraag","Botresorptie rondom proximale component"]
["Variabelenaam XML","boneResorptionProximal"]
["Variabelenaam database","rr_boneresorp_prox_comp"]
["Label EN","Bone resorption around proximal component"]
["Label NL","Botresorptie rondom proximale component"]
["Definitie","Botverlies rondom de proximale component ongeacht de reden"]
["Doel / reden uitvraag","Inzicht in revisie-operaties en kwaliteit"]
["Waarde verplicht","Functioneel verplicht"]
["Datatype","Integer (INT)"]
["Domein (acceptabele range, min-max)"]
["Eenheid"]
["Format (max. lengte)"]
["Decimalen"]
["Codering (EN/NL)","0=No/ Nee\n1=Yes/ Ja"]
["Periode","Sinds start registratie"]
["Wijziging (datum en reden)"]
["Noodzakelijk voor kwaliteitsindicatoren","Nee"]
["Opmerkingen"]
["Zorg Informatie Bouwsteen (ZIB)","ZIB: Verrichting\nContainer (1): Indicatie::Probleem\nContainer (2):\nDataelement: ProbleemNaam\nOmzetting naar LROI:"]
["Voorbeeld","<boneResorptionProximal>1</boneResorptionProximal>"]
[]
["Terug naar Overzicht"]

{"sheet":"Botresorptie rondom distal comp","index":72,"n_rows":23,"n_cols":2,"rows_kept":23,"cut":false,"hidden":false,"merged":[]}
["DATA_ID",{"$f":"INDEX(Overzicht_unique!$A:$AJ, MATCH($B$2,Overzicht_unique!$A:$A,0), 36)","v":"LROI579"}]
["LROI uitvraag","Botresorptie rondom distale component"]
["Variabelenaam XML","boneResorptionDistal"]
["Variabelenaam database","rr_boneresorp_dist_comp"]
["Label EN","Bone resorption around distal component"]
["Label NL","Botresorptie rondom distale component"]
["Definitie","Botverlies rondom de distale component ongeacht de reden"]
["Doel / reden uitvraag","Inzicht in revisie-operaties en kwaliteit"]
["Waarde verplicht","Functioneel verplicht"]
["Datatype","Integer (INT)"]
["Domein (acceptabele range, min-max)"]
["Eenheid"]
["Format (max. lengte)"]
["Decimalen"]
["Codering (EN/NL)","0=No/ Nee\n1=Yes/ Ja"]
["Periode","Sinds start registratie"]
["Wijziging (datum en reden)"]
["Noodzakelijk voor kwaliteitsindicatoren","Nee"]
["Opmerkingen"]
["Zorg Informatie Bouwsteen (ZIB)","ZIB: Verrichting\nContainer (1): Indicatie::Probleem\nContainer (2):\nDataelement: ProbleemNaam\nOmzetting naar LROI:"]
["Voorbeeld","<boneResorptionDistal>1</boneResorptionDistal>"]
[]
["Terug naar Overzicht"]

{"sheet":"Status na heupprothese-verwijde","index":73,"n_rows":23,"n_cols":2,"rows_kept":23,"cut":false,"hidden":false,"merged":[]}
["DATA_ID",{"$f":"INDEX(Overzicht_unique!$A:$AJ, MATCH($B$2,Overzicht_unique!$A:$A,0), 36)","v":"LROI031"}]
["LROI uitvraag","Status na heupprothese-verwijdering (Girdlestone)"]
["Variabelenaam XML","revisionAfterHipRemoval"]
["Variabelenaam database","rr_girdlestone_spacer"]
["Label EN","Status after hip prosthesis removal (Girdlestone)"]
["Label NL","Status na heupprothese-verwijdering (Girdlestone)"]
["Definitie","Re-implantatie na eerdere verwijdering van een heupprothese"]
["Doel / reden uitvraag","Inzicht in revisie-operaties en kwaliteit"]
["Waarde verplicht","Functioneel verplicht"]
["Datatype","Integer (INT)"]
["Domein (acceptabele range, min-max)"]
["Eenheid"]
["Format (max. lengte)"]
["Decimalen"]
["Codering (EN/NL)","0=No/ Nee\n1=Yes/ Ja"]
["Periode","Sinds start registratie"]
["Wijziging (datum en reden)","Term gewijzigd (voorheen \"Girdlestone/plaatsen spacer\") in LROI-ingrepen v5.1; 01-01-2022. Verzoek vanuit de leden om deze term te verduidelijken "]
["Noodzakelijk voor kwaliteitsindicatoren","Nee"]
["Opmerkingen"]
["Zorg Informatie Bouwsteen (ZIB)","ZIB: Verrichting\nContainer (1): Indicatie::Probleem\nContainer (2):\nDataelement: ProbleemNaam\nOmzetting naar LROI:"]
["Voorbeeld","<revisionAfterHipRemoval>1</revisionAfterHipRemoval>"]
[]
["Terug naar Overzicht"]

{"sheet":"Status na knieprotheseverwijder","index":74,"n_rows":23,"n_cols":2,"rows_kept":23,"cut":false,"hidden":false,"merged":[]}
["DATA_ID",{"$f":"INDEX(Overzicht_unique!$A:$AJ, MATCH($B$2,Overzicht_unique!$A:$A,0), 36)","v":"LROI124"}]
["LROI uitvraag","Status na knieprotheseverwijdering"]
["Variabelenaam XML","revisionAfterKneeRemoval"]
["Variabelenaam database","rr_revision_removal"]
["Label EN","Status after removal of knee prosthesis"]
["Label NL","Status na knieprotheseverwijdering"]
["Definitie","Re-implantatie na eerdere verwijdering van een knieprothese"]
["Doel / reden uitvraag","Inzicht in revisie-operaties en kwaliteit"]
["Waarde verplicht","Functioneel verplicht"]
["Datatype","Integer (INT)"]
["Domein (acceptabele range, min-max)"]
["Eenheid"]
["Format (max. lengte)"]
["Decimalen"]
["Codering (EN/NL)","0=No/ Nee\n1=Yes/ Ja"]
["Periode","Sinds start registratie"]
["Wijziging (datum en reden)","Term gewijzigd (voorheen \"Revisie na knieprotheseverwijdering\") in LROI-ingrepen v5.1; 01-01-2022. "]
["Noodzakelijk voor kwaliteitsindicatoren","Nee"]
["Opmerkingen"]
["Zorg Informatie Bouwsteen (ZIB)","ZIB: Verrichting\nContainer (1): Indicatie::Probleem\nContainer (2):\nDataelement: ProbleemNaam\nOmzetting naar LROI:"]
["Voorbeeld","<revisionAfterKneeRemoval>1</revisionAfterKneeRemoval>"]
[]
["Terug naar Overzicht"]

{"sheet":"Status na enkelprotheseverwijde","index":75,"n_rows":23,"n_cols":2,"rows_kept":23,"cut":false,"hidden":false,"merged":[]}
["DATA_ID",{"$f":"INDEX(Overzicht_unique!$A:$AJ, MATCH($B$2,Overzicht_unique!$A:$A,0), 36)","v":"LROI221"}]
["LROI uitvraag","Status na enkelprotheseverwijdering"]
["Variabelenaam XML","revisionAfterAnkleRemoval"]
["Variabelenaam database","rr_revision_removal"]
["Label EN","Status after removal of ankle prosthesis"]
["Label NL","Status na enkelprotheseverwijdering"]
["Definitie","Re-implantatie na eerdere verwijdering van een enkelprothese"]
["Doel / reden uitvraag","Inzicht in revisie-operaties en kwaliteit"]
["Waarde verplicht","Functioneel verplicht"]
["Datatype","Integer (INT)"]
["Domein (acceptabele range, min-max)"]
["Eenheid"]
["Format (max. lengte)"]
["Decimalen"]
["Codering (EN/NL)","0=No/ Nee\n1=Yes/ Ja"]
["Periode","Sinds LROI-ingrepen v5.1; 01-01-2022"]
["Wijziging (datum en reden)","Verwijdering van prothese kan worden geregistreerd, daarna zal (in gedeelte van de gevallen) ook weer een nieuwe prothese worden geplaatst. Dit wordt tot op heden niet ondervangen als reden voor revisie, daarom toegevoegd. Conform overige gewrichten. "]
["Noodzakelijk voor kwaliteitsindicatoren","Nee"]
["Opmerkingen"]
["Zorg Informatie Bouwsteen (ZIB)","ZIB: Verrichting\nContainer (1): Indicatie::Probleem\nContainer (2):\nDataelement: ProbleemNaam\nOmzetting naar LROI:"]
["Voorbeeld","<revisionAfterAnkleRemoval>1</revisionAfterAnkleRemoval>"]
[]
["Terug naar Overzicht"]

{"sheet":"Status na schouderprotheseverwi","index":76,"n_rows":23,"n_cols":2,"rows_kept":23,"cut":false,"hidden":false,"merged":[]}
["DATA_ID",{"$f":"INDEX(Overzicht_unique!$A:$AJ, MATCH($B$2,Overzicht_unique!$A:$A,0), 36)","v":"LROI298"}]
["LROI uitvraag","Status na schouderprotheseverwijdering"]
["Variabelenaam XML","revisionAfterShoulderRemoval"]
["Variabelenaam database","rr_revision_removal"]
["Label EN","Status after removal of shoulder prosthesis"]
["Label NL","Status na schouderprotheseverwijdering"]
["Definitie","Re-implantatie na eerdere verwijdering van een schouderprothese"]
["Doel / reden uitvraag","Inzicht in revisie-operaties en kwaliteit"]
["Waarde verplicht","Functioneel verplicht"]
["Datatype","Integer (INT)"]
["Domein (acceptabele range, min-max)"]
["Eenheid"]
["Format (max. lengte)"]
["Decimalen"]
["Codering (EN/NL)","0=No/ Nee\n1=Yes/ Ja"]
["Periode","Sinds LROI-ingrepen v5.1; 01-01-2022"]
["Wijziging (datum en reden)","Verwijdering van prothese kan worden geregistreerd, daarna zal (in gedeelte van de gevallen) ook weer een nieuwe prothese worden geplaatst. Dit wordt tot op heden niet ondervangen als reden voor revisie, daarom toegevoegd. Conform overige gewrichten. "]
["Noodzakelijk voor kwaliteitsindicatoren","Nee"]
["Opmerkingen"]
["Zorg Informatie Bouwsteen (ZIB)","ZIB: Verrichting\nContainer (1): Indicatie::Probleem\nContainer (2):\nDataelement: ProbleemNaam\nOmzetting naar LROI:"]
["Voorbeeld","<revisionAfterShoulderRemoval>1</revisionAfterShoulderRemoval>"]
[]
["Terug naar Overzicht"]

{"sheet":"Status na elleboogprotheseverwi","index":77,"n_rows":23,"n_cols":2,"rows_kept":23,"cut":false,"hidden":false,"merged":[]}
["DATA_ID",{"$f":"INDEX(Overzicht_unique!$A:$AJ, MATCH($B$2,Overzicht_unique!$A:$A,0), 36)","v":"LROI387"}]
["LROI uitvraag","Status na elleboogprotheseverwijdering"]
["Variabelenaam XML","revisionAfterElbowRemoval"]
["Variabelenaam database","rr_revision_removal"]
["Label EN","Status after removal of Elbow prosthesis"]
["Label NL","Status na elleboogprotheseverwijdering"]
["Definitie","Re-implantatie na eerdere verwijdering van een elleboogprothese"]
["Doel / reden uitvraag","Inzicht in revisie-operaties en kwaliteit"]
["Waarde verplicht","Functioneel verplicht"]
["Datatype","Integer (INT)"]
["Domein (acceptabele range, min-max)"]
["Eenheid"]
["Format (max. lengte)"]
["Decimalen"]
["Codering (EN/NL)","0=No/ Nee\n1=Yes/ Ja"]
["Periode","Sinds LROI-ingrepen v5.1; 01-01-2022"]
["Wijziging (datum en reden)","Verwijdering van prothese kan worden geregistreerd, daarna zal (in gedeelte van de gevallen) ook weer een nieuwe prothese worden geplaatst. Dit wordt tot op heden niet ondervangen als reden voor revisie, daarom toegevoegd. Conform overige gewrichten. "]
["Noodzakelijk voor kwaliteitsindicatoren","Nee"]
["Opmerkingen"]
["Zorg Informatie Bouwsteen (ZIB)","ZIB: Verrichting\nContainer (1): Indicatie::Probleem\nContainer (2):\nDataelement: ProbleemNaam\nOmzetting naar LROI:"]
["Voorbeeld","<revisionAfterElbowRemoval>1</revisionAfterElbowRemoval>"]
[]
["Terug naar Overzicht"]

{"sheet":"Status na polsprotheseverwijder","index":78,"n_rows":23,"n_cols":2,"rows_kept":23,"cut":false,"hidden":false,"merged":[]}
["DATA_ID",{"$f":"INDEX(Overzicht_unique!$A:$AJ, MATCH($B$2,Overzicht_unique!$A:$A,0), 36)","v":"LROI484"}]
["LROI uitvraag","Status na polsprotheseverwijdering"]
["Variabelenaam XML","revisionAfterWristRemoval"]
["Variabelenaam database","rr_revision_removal"]
["Label EN","Status after removal of wrist prosthesis"]
["Label NL","Status na polsprotheseverwijdering"]
["Definitie","Re-implantatie na eerdere verwijdering van een polsprothese"]
["Doel / reden uitvraag","Inzicht in revisie-operaties en kwaliteit"]
["Waarde verplicht","Functioneel verplicht"]
["Datatype","Integer (INT)"]
["Domein (acceptabele range, min-max)"]
["Eenheid"]
["Format (max. lengte)"]
["Decimalen"]
["Codering (EN/NL)","0=No/ Nee\n1=Yes/ Ja"]
["Periode","Sinds LROI-ingrepen v5.1; 01-01-2022"]
["Wijziging (datum en reden)","Verwijdering van prothese kan worden geregistreerd, daarna zal (in gedeelte van de gevallen) ook weer een nieuwe prothese worden geplaatst. Dit wordt tot op heden niet ondervangen als reden voor revisie, daarom toegevoegd. Conform overige gewrichten. "]
["Noodzakelijk voor kwaliteitsindicatoren","Nee"]
["Opmerkingen"]
["Zorg Informatie Bouwsteen (ZIB)","ZIB: Verrichting\nContainer (1): Indicatie::Probleem\nContainer (2):\nDataelement: ProbleemNaam\nOmzetting naar LROI:"]
["Voorbeeld","<revisionAfterWristRemoval>1</revisionAfterWristRemoval>"]
[]
["Terug naar Overzicht"]

{"sheet":"Status na vingerprotheseverwijd","index":79,"n_rows":23,"n_cols":2,"rows_kept":23,"cut":false,"hidden":false,"merged":[]}
["DATA_ID",{"$f":"INDEX(Overzicht_unique!$A:$AJ, MATCH($B$2,Overzicht_unique!$A:$A,0), 36)","v":"LROI580"}]
["LROI uitvraag","Status na vingerprotheseverwijdering"]
["Variabelenaam XML","revisionAfterFingerRemoval"]
["Variabelenaam database","rr_revision_removal"]
["Label EN","Status after removal of finger prosthesis"]
["Label NL","Status na vingerprotheseverwijdering"]
["Definitie","Re-implantatie na eerdere verwijdering van een vingerprothese"]
["Doel / reden uitvraag","Inzicht in revisie-operaties en kwaliteit"]
["Waarde verplicht","Functioneel verplicht"]
["Datatype","Integer (INT)"]
["Domein (acceptabele range, min-max)"]
["Eenheid"]
["Format (max. lengte)"]
["Decimalen"]
["Codering (EN/NL)","0=No/ Nee\n1=Yes/ Ja"]
["Periode","Sinds LROI-ingrepen v5.1; 01-01-2022"]
["Wijziging (datum en reden)","Verwijdering van prothese kan worden geregistreerd, daarna zal (in gedeelte van de gevallen) ook weer een nieuwe prothese worden geplaatst. Dit wordt tot op heden niet ondervangen als reden voor revisie, daarom toegevoegd. Conform overige gewrichten. "]
["Noodzakelijk voor kwaliteitsindicatoren","Nee"]
["Opmerkingen"]
["Zorg Informatie Bouwsteen (ZIB)","ZIB: Verrichting\nContainer (1): Indicatie::Probleem\nContainer (2):\nDataelement: ProbleemNaam\nOmzetting naar LROI:"]
["Voorbeeld","<revisionAfterFingerRemoval>1</revisionAfterFingerRemoval>"]
[]
["Terug naar Overzicht"]

{"sheet":"Andere reden voor revisie","index":80,"n_rows":23,"n_cols":2,"rows_kept":23,"cut":false,"hidden":false,"merged":[]}
["DATA_ID",{"$f":"INDEX(Overzicht_unique!$A:$AJ, MATCH($B$2,Overzicht_unique!$A:$A,0), 36)","v":"LROI032, LROI126, LROI222, LROI299, LROI388, LROI485, LROI581"}]
["LROI uitvraag","Andere reden voor revisie"]
["Variabelenaam XML","otherReasonForRevision"]
["Variabelenaam database","rr_other"]
["Label EN","Other reason for revision"]
["Label NL","Andere reden voor revisie"]
["Definitie","Reden voor revisie anders dan keuzemogelijkheden "]
["Doel / reden uitvraag","Inzicht in revisie-operaties en kwaliteit"]
["Waarde verplicht","Functioneel verplicht"]
["Datatype","Integer (INT)"]
["Domein (acceptabele range, min-max)"]
["Eenheid"]
["Format (max. lengte)"]
["Decimalen"]
["Codering (EN/NL)","0=No/ Nee\n1=Yes/ Ja"]
["Periode","Sinds start registratie"]
["Wijziging (datum en reden)"]
["Noodzakelijk voor kwaliteitsindicatoren","Nee"]
["Opmerkingen"]
["Zorg Informatie Bouwsteen (ZIB)","ZIB: Verrichting\nContainer (1): Indicatie::Probleem\nContainer (2):\nDataelement: ProbleemNaam\nOmzetting naar LROI:"]
["Voorbeeld","<otherReasonForRevision>1</otherReasonForRevision>"]
[]
["Terug naar Overzicht"]

{"sheet":"Andere reden voor revisie, spec","index":81,"n_rows":23,"n_cols":2,"rows_kept":23,"cut":false,"hidden":false,"merged":[]}
["DATA_ID",{"$f":"INDEX(Overzicht_unique!$A:$AJ, MATCH($B$2,Overzicht_unique!$A:$A,0), 36)","v":"LROI033, LROI127, LROI223, LROI300, LROI389, LROI486, LROI582"}]
["LROI uitvraag","Andere reden voor revisie, specificeer"]
["Variabelenaam XML","reasonRevisionOther"]
["Variabelenaam database","rr_other_spec"]
["Label EN","Other reason for revision, specify"]
["Label NL","Andere reden voor revisie, specificeer"]
["Definitie","Reden voor revisie anders dan keuzemogelijkheden "]
["Doel / reden uitvraag","Inzicht in revisie-operaties en kwaliteit; Leren en verbeteren; inzicht in diagnoses die niet tot de keuzemogelijkheden behoren "]
["Waarde verplicht","Functioneel verplicht wanneer er ‘Andere diagnose’ geregistreerd is"]
["Datatype","Tekst (TXT) "]
["Domein (acceptabele range, min-max)"]
["Eenheid"]
["Format (max. lengte)"]
["Decimalen"]
["Codering (EN/NL)"]
["Periode","Sinds start registratie (geldt niet voor alle gewrichten)"]
["Wijziging (datum en reden)","Specificeerveld toegevoegd voor heup en knie in LROI-ingrepen v5.1; 01-01-2022"]
["Noodzakelijk voor kwaliteitsindicatoren","Nee"]
["Opmerkingen","Specificeerveld in tekst"]
["Zorg Informatie Bouwsteen (ZIB)","ZIB: Verrichting\nContainer (1): Indicatie::Probleem\nContainer (2):\nDataelement: ProbleemNaam\nOmzetting naar LROI:"]
["Voorbeeld","<reasonRevisionOther>Impingement</reasonRevisionOther>"]
[]
["Terug naar Overzicht"]

{"sheet":"Specialisme","index":82,"n_rows":23,"n_cols":2,"rows_kept":23,"cut":false,"hidden":false,"merged":[]}
["DATA_ID",{"$f":"INDEX(Overzicht_unique!$A:$AJ, MATCH($B$2,Overzicht_unique!$A:$A,0), 36)","v":"LROI043, LROI301, LROI394, LROI497, LROI588"}]
["LROI uitvraag","Specialisme"]
["Variabelenaam XML","specialism"]
["Variabelenaam database","specialism"]
["Label EN","Specialism"]
["Label NL","Specialisme"]
["Definitie","Prothese-operaties worden uitgevoerd door verschillende medisch specialismen. De specialismen zijn orthopedie, traumachirurgie en plastische chirurgie.  "]
["Doel / reden uitvraag","Inzicht in kwaliteit"]
["Waarde verplicht","Functioneel verplicht "]
["Datatype","Integer (INT)"]
["Domein (acceptabele range, min-max)"]
["Eenheid"]
["Format (max. lengte)"]
["Decimalen"]
["Codering (EN/NL)","Heup, schouder, elleboog:\n0= Orthopedics/Orthopedie\n1= Trauma surgery/Traumachirurgie\nPols, vinger:\n1= Orthopaedics/Orthopedie\n2= Plastic Surgery/Plastische chirurgie\n3= Trauma surgery/Traumachirurgie"]
["Periode","Sinds start registratie (geldt niet voor alle gewrichten)"]
["Wijziging (datum en reden)","Specialisme toegevoegd voor elleboog in LROI-ingrepen v5.1; 01-01-2022. Label 3=Traumchirurgie toegevoegd voor pols/vinger in LROI-ingrepen v5.1; 01-01-2022"]
["Noodzakelijk voor kwaliteitsindicatoren","Nee"]
["Opmerkingen","LROI registeraccounts kunnen worden samengevoegd voor meerdere specialismen of zijn opgesplitst in aparte accounts. "]
["Zorg Informatie Bouwsteen (ZIB)","ZIB: Verrichting\nContainer (1): Uitvoerder::Zorgverlener\nContainer (2):\nDataelement: Specialisme\nOmzetting naar LROI:"]
["Voorbeeld","<specialism>0</specialism>"]
[]
["Terug naar Overzicht"]

{"sheet":"BIG hoofdoperateur","index":83,"n_rows":23,"n_cols":2,"rows_kept":23,"cut":false,"hidden":false,"merged":[]}
["DATA_ID",{"$f":"INDEX(Overzicht_unique!$A:$AJ, MATCH($B$2,Overzicht_unique!$A:$A,0), 36)","v":"LROI044, LROI143, LROI232, LROI302, LROI395, LROI498, LROI589"}]
["LROI uitvraag","BIG hoofdoperateur"]
["Variabelenaam XML","surgeonCode"]
["Variabelenaam database","big; big_encrypted; big_encypted_si"]
["Label EN","Surgeon Code"]
["Label NL","BIG hoofdoperateur"]
["Definitie","De hoofdoperateur is degene die verantwoordelijk is voor het uitvoeren van de prothese-operatie. Het BIG nummer bestaat uit 11 cijfers. Het BIG-register (Beroepen in de Individuele Gezondheidszorg) is een wettelijk, online en openbaar register. Alleen wie in het BIG-register staat, mag een beschermde beroepstitel voeren en mag de bij het beroep horende voorbehouden handelingen zelfstandig uitvoeren. "]
["Doel / reden uitvraag","Inzicht in kwaliteit"]
["Waarde verplicht","Functioneel verplicht "]
["Datatype","Tekst (TXT) "]
["Domein (acceptabele range, min-max)","11 cijfers"]
["Eenheid"]
["Format (max. lengte)",250]
["Decimalen"]
["Codering (EN/NL)","Geëncrypteerde waarde"]
["Periode","Sinds start registratie "]
["Wijziging (datum en reden)","Tot 2016 werd de chirurg geregistreerd met een door het ziekenhuis gekozen nummer. Vanaf 2016 kan alléén nog maar het BIG nummer worden geregistreerd. Vanaf 2019 kan het BIG nummer versleuteld of onversleuteld in de LROI worden opgeslagen."]
["Noodzakelijk voor kwaliteitsindicatoren","Nee"]
["Opmerkingen","Alleen nummer invoer mogelijk (het is een TXT veld wegens ZorgTTP ). Twee manieren van aanleveren: versleuteld of onversleuteld. Versleuteling door ZorgTTP: het BSN wordt direct geëncrypteerd via de module TRES van ZorgTTP. Sinds 2019 is het mogelijk om het BIG nummer onversleuteld in de LROI op te slaan. "]
["Zorg Informatie Bouwsteen (ZIB)","ZIB: Verrichting\nContainer (1): Uitvoerder::Zorgverlener\nContainer (2):\nDataelement: ZorgverlenerIdentificatienummer\nOmzetting naar LROI:"]
["Voorbeeld","<surgeonCode>3::80c379d1-a257-4908-82c4-61ced4df85b4::1:U6HTe16W+UawqCI6INtsVg==::1:D7VZ+6biW7c0HMbbpp1bJ3hdn7tn0dAYLD75wt3yLM9aCjIo3i+xwhF6CS2FOIS6::UQPJZ2N00ixd9Ga0x7VAaQkqCIyxYPagUwdLzBQB+pA=</surgeonCode>"]
[]
["Terug naar Overzicht"]

{"sheet":"BIG assisterend chirurg","index":84,"n_rows":23,"n_cols":2,"rows_kept":23,"cut":false,"hidden":false,"merged":[]}
["DATA_ID",{"$f":"INDEX(Overzicht_unique!$A:$AJ, MATCH($B$2,Overzicht_unique!$A:$A,0), 36)","v":"LROI045, LROI144, LROI233, LROI303, LROI396, LROI499, LROI590"}]
["LROI uitvraag","BIG assisterend chirurg"]
["Variabelenaam XML","assistantSurgeonCode"]
["Variabelenaam database","assist_surgeon_code; assist_surgeon_code_si"]
["Label EN","Assistant Surgeon Code"]
["Label NL","BIG assisterend chirurg"]
["Definitie","De hoofdoperateur is degene die verantwoordelijk is voor het uitvoeren van de prothese-operatie. Het BIG nummer bestaat uit 11 cijfers. Het BIG-register (Beroepen in de Individuele Gezondheidszorg) is een wettelijk, online en openbaar register. Alleen wie in het BIG-register staat, mag een beschermde beroepstitel voeren en mag de bij het beroep horende voorbehouden handelingen zelfstandig uitvoeren. "]
["Doel / reden uitvraag","Inzicht in kwaliteit"]
["Waarde verplicht","Functioneel verplicht "]
["Datatype","Tekst (TXT) "]
["Domein (acceptabele range, min-max)","11 cijfers"]
["Eenheid"]
["Format (max. lengte)",250]
["Decimalen"]
["Codering (EN/NL)","Geëncrypteerde waarde"]
["Periode","Sinds start registratie "]
["Wijziging (datum en reden)","Tot 2016 werd de chirurg geregistreerd met een door het ziekenhuis gekozen nummer. Vanaf 2016 kan alléén nog maar het BIG nummer worden geregistreerd. Vanaf 2019 kan het BIG nummer versleuteld of onversleuteld in de LROI worden opgeslagen."]
["Noodzakelijk voor kwaliteitsindicatoren","Nee"]
["Opmerkingen","Alleen nummer invoer mogelijk (het is een TXT veld wegens ZorgTTP ). Twee manieren van aanleveren: versleuteld of onversleuteld. Versleuteling door ZorgTTP: het BSN wordt direct geëncrypteerd via de module TRES van ZorgTTP. Sinds 2019 is het mogelijk om het BIG nummer onversleuteld in de LROI op te slaan. "]
["Zorg Informatie Bouwsteen (ZIB)","ZIB: Verrichting\nContainer (1): Uitvoerder::Zorgverlener\nContainer (2):\nDataelement: ZorgverlenerIdentificatienummer\nOmzetting naar LROI:"]
["Voorbeeld","<assistantSurgeonCode>12345678910</assistantSurgeonCode>"]
[]
["Terug naar Overzicht"]

{"sheet":"Type prothese","index":85,"n_rows":23,"n_cols":2,"rows_kept":23,"cut":false,"hidden":false,"merged":[]}
["DATA_ID",{"$f":"INDEX(Overzicht_unique!$A:$AJ, MATCH($B$2,Overzicht_unique!$A:$A,0), 36)","v":"LROI034, LROI128, LROI224, LROI304, LROI390, LROI487"}]
["LROI uitvraag","Type prothese"]
["Variabelenaam XML","prosthesisType"]
["Variabelenaam database","type_pros"]
["Label EN","Prosthesis type"]
["Label NL","Type prothese"]
["Definitie","Het type gewrichtprothese dat geplaatst wordt. Er zijn verschillende soorten prothesen waaruit gekozen kan worden. "]
["Doel / reden uitvraag","Inzicht in kwaliteit; kwaliteitsindicatoren voor totale heupprothesen, totale knieprothesen en unicondylaire knieprothesen."]
["Waarde verplicht","Functioneel verplicht "]
["Datatype","Integer (INT)"]
["Domein (acceptabele range, min-max)"]
["Eenheid"]
["Format (max. lengte)"]
["Decimalen"]
["Codering (EN/NL)","Heup:\n0=Total hip prosthesis (THP)/Totale heupprothese\n1=Hemi-prosthesis (KHP)/Kophalsprothese\n2=Resurfacing prosthesis/Resurfacing prothese\n99=Other prosthesis type, specify/Ander type prothese, specificeer\nKnie: \n0=Unicondylar knee prosthesis/Unicondylaire knieprothese\n1=Total knee prosthesis\t/Totale knieprothese\n2=Patellofemoral knee prosthesis/Patellofemorale knieprothese\n99=Other prosthesis type, specify/Ander type prothese, specificeer\nEnkel:\n0=Total ankle prosthesis/Totale enkelprothese\n99=Other prosthesis type, specify/Ander type prothese, specificeer\nSchouder:\n0=Total shoulder prosthesis/Totale anatomische schouderprothese\n1=Reversed prosthesis/Reversed schouderprothese\n2=Hemi-prosthesis/Hemischouderprothese\n99=Other prosthesis type, specify/Ander type prothese, specificeer\nElleboog:\n0=Total elbow prosthesis/Totale elleboogprothese\n1=Radiocapitellar prosthesis/Radiocapitellaire prothese\n2=Radial head prosthesis/Radiuskopprothese\n3=Distal hemi-humeral prosthesis/Distale hemi-humerale prosthese\n99=Other prosthesis type, specify/Ander type prothese, specificeer\nPols: \n1=total wrist prosthesis/Totale polsprothese\n2=Hemi-prosthesis/Hemiprothese\n3=Ulna head prosthesis/Ulnakopprothese\n4=DRU-prosthesis/DRU-prothese\n99=Other prosthesis type, specify/Ander type prothese, specificeer"]
["Periode","Sinds start registratie"]
["Wijziging (datum en reden)","Nieuwe antwoordopties toegevoegd voor pols in LROI-ingrepen v5.1; 01-01-2022"]
["Noodzakelijk voor kwaliteitsindicatoren","Ja"]
["Opmerkingen"]
["Zorg Informatie Bouwsteen (ZIB)","ZIB: Verrichting\nContainer (1): MedischHulpmiddel::MedischHulpmiddel\nContainer (2): Product\nDataelement: ProductType; ProductID\nOmzetting naar LROI:"]
["Voorbeeld","<prosthesisType>0</prosthesisType>"]
[]
["Terug naar Overzicht"]

{"sheet":"Ander type prothese, spec","index":86,"n_rows":23,"n_cols":2,"rows_kept":23,"cut":false,"hidden":false,"merged":[]}
["DATA_ID",{"$f":"INDEX(Overzicht_unique!$A:$AJ, MATCH($B$2,Overzicht_unique!$A:$A,0), 36)","v":"LROI035, LROI129, LROI225, LROI305, LROI391, LROI488"}]
["LROI uitvraag","Ander type prothese, specificeer"]
["Variabelenaam XML","prosthesisOther"]
["Variabelenaam database","pros_other"]
["Label EN","Other prosthesis type, specify"]
["Label NL","Ander type prothese, specificeer"]
["Definitie","Het type gewrichtprothese dat geplaatst wordt, anders dan keuzemogelijkheden"]
["Doel / reden uitvraag","Inzicht in kwaliteit; Leren en verbeteren; inzicht in soort prothesen die niet tot de keuzemogelijkheden behoren "]
["Waarde verplicht","Functioneel verplicht wanneer er ‘Andere type prothese’ geregistreerd is"]
["Datatype","Tekst (TXT) "]
["Domein (acceptabele range, min-max)"]
["Eenheid"]
["Format (max. lengte)",40]
["Decimalen"]
["Codering (EN/NL)"]
["Periode","Sinds start registratie"]
["Wijziging (datum en reden)"]
["Noodzakelijk voor kwaliteitsindicatoren","Nee"]
["Opmerkingen","Specificeerveld in tekst"]
["Zorg Informatie Bouwsteen (ZIB)","ZIB: Verrichting\nContainer (1): MedischHulpmiddel::MedischHulpmiddel\nContainer (2): Product\nDataelement: ProductType; ProductID\nOmzetting naar LROI:"]
["Voorbeeld","<prosthesisOther>tumor</prosthesisOther>"]
[]
["Terug naar Overzicht"]

{"sheet":"Indien unicondylair, zijde prot","index":87,"n_rows":23,"n_cols":2,"rows_kept":23,"cut":false,"hidden":false,"merged":[]}
["DATA_ID",{"$f":"INDEX(Overzicht_unique!$A:$AJ, MATCH($B$2,Overzicht_unique!$A:$A,0), 36)","v":"LROI130"}]
["LROI uitvraag","Indien unicondylair, zijde prothese"]
["Variabelenaam XML","unicondylar"]
["Variabelenaam database","unicondylar_side"]
["Label EN","If unicondylar, prosthesis side"]
["Label NL","Indien unicondylair, zijde prothese"]
["Definitie","Plaatsing zijde van unicondylaire knieprothese. Bij een unicondylaire knieprothese (halve knieprothese) wordt een zijde van de knie vervangen door een prothese. "]
["Doel / reden uitvraag","Inzicht in kwaliteit en type prothese"]
["Waarde verplicht","Functioneel verplicht "]
["Datatype","Integer (INT)"]
["Domein (acceptabele range, min-max)"]
["Eenheid"]
["Format (max. lengte)"]
["Decimalen"]
["Codering (EN/NL)","1=Medial/Mediaal\n2=Lateral/Lateraal"]
["Periode","Sinds start registratie"]
["Wijziging (datum en reden)"]
["Noodzakelijk voor kwaliteitsindicatoren","Nee"]
["Opmerkingen"]
["Zorg Informatie Bouwsteen (ZIB)","ZIB: Verrichting\nContainer (1): MedischHulpmiddel::MedischHulpmiddel\nContainer (2): Product\nDataelement: ProductType; ProductID\nOmzetting naar LROI:"]
["Voorbeeld","<unicondylar>1</unicondylar>"]
[]
["Terug naar Overzicht"]

{"sheet":"Plaatsing patellacomponent","index":88,"n_rows":23,"n_cols":2,"rows_kept":23,"cut":false,"hidden":false,"merged":[]}
["DATA_ID",{"$f":"INDEX(Overzicht_unique!$A:$AJ, MATCH($B$2,Overzicht_unique!$A:$A,0), 36)","v":"LROI131"}]
["LROI uitvraag","Plaatsing patellacomponent"]
["Variabelenaam XML","patellaComponent"]
["Variabelenaam database","patella_resurf"]
["Label EN","Patella component"]
["Label NL","Plaatsing patellacomponent"]
["Definitie","Plaatsing van patellacomponent tijdens knieprothese operatie. Vul ‘ja’ of ‘nee’ indien er wel of geen patellacomponent is geplaatst."]
["Doel / reden uitvraag","Inzicht in kwaliteit en type prothese"]
["Waarde verplicht","Functioneel verplicht "]
["Datatype","Integer (INT)"]
["Domein (acceptabele range, min-max)"]
["Eenheid"]
["Format (max. lengte)"]
["Decimalen"]
["Codering (EN/NL)","0=No/ Nee\n1=Yes/ Ja"]
["Periode","Sinds start registratie"]
["Wijziging (datum en reden)"]
["Noodzakelijk voor kwaliteitsindicatoren","Nee"]
["Opmerkingen"]
["Zorg Informatie Bouwsteen (ZIB)","ZIB: Verrichting\nContainer (1): MedischHulpmiddel::MedischHulpmiddel\nContainer (2): Product\nDataelement: ProductType; ProductID\nOmzetting naar LROI:"]
["Voorbeeld","<patellaComponent>1</patellaComponent>"]
[]
["Terug naar Overzicht"]

{"sheet":"Radiuskopcomponent geplaatst","index":89,"n_rows":23,"n_cols":2,"rows_kept":23,"cut":false,"hidden":false,"merged":[]}
["DATA_ID",{"$f":"INDEX(Overzicht_unique!$A:$AJ, MATCH($B$2,Overzicht_unique!$A:$A,0), 36)","v":"LROI392"}]
["LROI uitvraag","Radiuskopcomponent geplaatst"]
["Variabelenaam XML","radialHeadComp"]
["Variabelenaam database"]
["Label EN","Radial head component placed"]
["Label NL","Radiuskopcomponent geplaatst"]
["Definitie","Plaatsing van radiuskopcomponent tijdens elleboogprothese operatie. Vul ‘ja’ of ‘nee’ indien er wel of geen radiuskopcomponent is geplaatst."]
["Doel / reden uitvraag","Inzicht in kwaliteit en type prothese"]
["Waarde verplicht","Functioneel verplicht "]
["Datatype","Integer (INT)"]
["Domein (acceptabele range, min-max)"]
["Eenheid"]
["Format (max. lengte)"]
["Decimalen"]
["Codering (EN/NL)","0=No/ Nee\n1=Yes/ Ja"]
["Periode","Sinds start registratie"]
["Wijziging (datum en reden)"]
["Noodzakelijk voor kwaliteitsindicatoren","Nee"]
["Opmerkingen"]
["Zorg Informatie Bouwsteen (ZIB)","ZIB: Verrichting\nContainer (1): MedischHulpmiddel::MedischHulpmiddel\nContainer (2): Product\nDataelement: ProductType; ProductID\nOmzetting naar LROI:"]
["Voorbeeld","<radialHeadComp>1</radialHeadComp>"]
[]
["Terug naar Overzicht"]

{"sheet":"Prothese gelinkt","index":90,"n_rows":23,"n_cols":2,"rows_kept":23,"cut":false,"hidden":false,"merged":[]}
["DATA_ID",{"$f":"INDEX(Overzicht_unique!$A:$AJ, MATCH($B$2,Overzicht_unique!$A:$A,0), 36)","v":"LROI393"}]
["LROI uitvraag","Prothese gelinkt"]
["Variabelenaam XML","prosthesisLinked"]
["Variabelenaam database","type_linked_pros"]
["Label EN","Prosthesis linked"]
["Label NL","Prothese gelinkt"]
["Definitie","Het linked en unlinked plaatsen van een elleboogprothese is afhankelijk van de eigenschap van de prothese. (zijn de eigenschappen met elkaar vast (linked) verbonden of niet (unlinked). Vaak kunnen we deze eigenschap dan ook via het artikelnummer achterhalen. Echter zijn er (zo is bij ons aangegeven via de WSE) ook implantaten die je zowel linked als unlinked kunt plaatsen (lattitude). Dat is de reden waarom deze eigenschap ook uitgevraagd wordt op het registratieformulier. "]
["Doel / reden uitvraag","Inzicht in kwaliteit en type prothese"]
["Waarde verplicht","Functioneel verplicht "]
["Datatype","Integer (INT)"]
["Domein (acceptabele range, min-max)"]
["Eenheid"]
["Format (max. lengte)"]
["Decimalen"]
["Codering (EN/NL)","0=Linked/Gelinkt\n1=Unlinked/Niet gelinkt"]
["Periode","Sinds start registratie"]
["Wijziging (datum en reden)"]
["Noodzakelijk voor kwaliteitsindicatoren","Nee"]
["Opmerkingen","De linked / unlinked (of constrained) heeft te maken met de articulatie tussen de humerus component en de ulna component. Zie hier wat info van orthobullets en voorbeelde van protheses bij elk type: https://www.orthobullets.com/shoulder-and-elbow/3089/total-elbow-arthroplasty "]
["Zorg Informatie Bouwsteen (ZIB)","ZIB: Verrichting\nContainer (1): MedischHulpmiddel::MedischHulpmiddel\nContainer (2): Product\nDataelement: ProductType; ProductID\nOmzetting naar LROI:"]
["Voorbeeld","<prosthesisLinked>1</prosthesisLinked>"]
[]
["Terug naar Overzicht"]

{"sheet":"Gereviseerde prothese","index":91,"n_rows":23,"n_cols":2,"rows_kept":23,"cut":false,"hidden":false,"merged":[]}
["DATA_ID",{"$f":"INDEX(Overzicht_unique!$A:$AJ, MATCH($B$2,Overzicht_unique!$A:$A,0), 36)","v":"LROI306"}]
["LROI uitvraag","Gereviseerde prothese"]
["Variabelenaam XML","revisedProsthesis"]
["Variabelenaam database","revd_pros"]
["Label EN","Revised prosthesis"]
["Label NL","Gereviseerde prothese"]
["Definitie","De reeds aanwezige schouderprothese die bij de huidige verrichting gereviseerd wordt"]
["Doel / reden uitvraag","Inzicht in kwaliteit en type revisie"]
["Waarde verplicht","Functioneel verplicht "]
["Datatype","Integer (INT)"]
["Domein (acceptabele range, min-max)"]
["Eenheid"]
["Format (max. lengte)"]
["Decimalen"]
["Codering (EN/NL)","0=Total shoulder prosthesis/Totale anatomische schouderprothese\n1=Reversed prosthesis/Reversed schouderprothese\n2=Hemi-prosthesis/Hemischouderprothese\n"]
["Periode","Sinds start registratie"]
["Wijziging (datum en reden)"]
["Noodzakelijk voor kwaliteitsindicatoren","Nee"]
["Opmerkingen"]
["Zorg Informatie Bouwsteen (ZIB)","ZIB: MedischHulpmiddel\nContainer (1): Product\nContainer (2): \nDataelement: ProductType; Lateraliteit; VerrichtingLateraliteit\nOmzetting naar LROI:"]
["Voorbeeld","<revisedProsthesis>1</revisedProsthesis>"]
[]
["Terug naar Overzicht"]

{"sheet":"Type humeral comp v gerev proth","index":92,"n_rows":23,"n_cols":2,"rows_kept":23,"cut":false,"hidden":false,"merged":[]}
["DATA_ID",{"$f":"INDEX(Overzicht_unique!$A:$AJ, MATCH($B$2,Overzicht_unique!$A:$A,0), 36)","v":"LROI307"}]
["LROI uitvraag","Type humerale component van gereviseerde prothese"]
["Variabelenaam XML","humeralComponent"]
["Variabelenaam database","type_revd_humeralstem"]
["Label EN","Type humeral component of reversed prosthesis"]
["Label NL","Type humerale component van gereviseerde prothese"]
["Definitie","De humerale component van de reeds aanwezig schouderprothese die bij de huidige verrichting gereviseerd wordt"]
["Doel / reden uitvraag","Inzicht in kwaliteit en type revisie"]
["Waarde verplicht","Functioneel verplicht "]
["Datatype","Integer (INT)"]
["Domein (acceptabele range, min-max)"]
["Eenheid"]
["Format (max. lengte)"]
["Decimalen"]
["Codering (EN/NL)","0=Normal stem/Normale steel\n1=Short stem/Korte steel\n2=Stemless/Geen steel\n3=Resurfacing/Resurfacing"]
["Periode","Sinds start registratie"]
["Wijziging (datum en reden)"]
["Noodzakelijk voor kwaliteitsindicatoren","Nee"]
["Opmerkingen"]
["Zorg Informatie Bouwsteen (ZIB)","ZIB: MedischHulpmiddel\nContainer (1): Product\nContainer (2): \nDataelement: ProductType\nOmzetting naar LROI:"]
["Voorbeeld","<humeralComponent>1</humeralComponent>"]
[]
["Terug naar Overzicht"]

{"sheet":"Type revisie","index":93,"n_rows":23,"n_cols":2,"rows_kept":23,"cut":false,"hidden":false,"merged":[]}
["DATA_ID",{"$f":"INDEX(Overzicht_unique!$A:$AJ, MATCH($B$2,Overzicht_unique!$A:$A,0), 36)","v":"LROI036, LROI132, LROI226, LROI308, LROI397, LROI489, LROI583"}]
["LROI uitvraag","Type revisie"]
["Variabelenaam XML","revisionType"]
["Variabelenaam database","type_revision"]
["Label EN","Type of revision"]
["Label NL","Type revisie"]
["Definitie","Het type revisie-operatie. Een revisie-ingreep is elke verandering (plaatsing, vervanging, verwijdering of toevoeging) van één of meerdere componenten van de gewrichtsprothese."]
["Doel / reden uitvraag","Inzicht in kwaliteit en kwaliteitsindicatoren"]
["Waarde verplicht","Functioneel verplicht "]
["Datatype","Integer (INT)"]
["Domein (acceptabele range, min-max)"]
["Eenheid"]
["Format (max. lengte)"]
["Decimalen"]
["Codering (EN/NL)","0=Partial revision/Partiële revisie\n1=Total system revision/Totale revisie\n3=Removal of prosthesis (with potential placement spacer)/Girdlestone situatie (met evt. plaatsing spacer) (heup)\n3=Removal of prosthesis (with possibly placement spacer)/Verwijdering van prothese (met evt. plaatsing spacer) (overige gewrichten)\n99=Other revision type, specify/Ander type revisie, specificeer"]
["Periode","Sinds start registratie"]
["Wijziging (datum en reden)"]
["Noodzakelijk voor kwaliteitsindicatoren","Ja"]
["Opmerkingen"]
["Zorg Informatie Bouwsteen (ZIB)","ZIB: Verrichting\nContainer (1): \nContainer (2): \nDataelement: VerrichtingType\nOmzetting naar LROI:"]
["Voorbeeld","<revisionType>1</revisionType>"]
[]
["Terug naar Overzicht"]

{"sheet":"Ander type revisie, spec","index":94,"n_rows":23,"n_cols":2,"rows_kept":23,"cut":false,"hidden":false,"merged":[]}
["DATA_ID",{"$f":"INDEX(Overzicht_unique!$A:$AJ, MATCH($B$2,Overzicht_unique!$A:$A,0), 36)","v":"LROI037, LROI133, LROI227, LROI309, LROI398, LROI490, LROI584"}]
["LROI uitvraag","Ander type revisie, specificeer"]
["Variabelenaam XML","revisionOther"]
["Variabelenaam database","rev_other"]
["Label EN","Other type of revision, specify"]
["Label NL","Ander type revisie, specificeer"]
["Definitie","Het type revisie-operatie, anders dan keuzemogelijkheden"]
["Doel / reden uitvraag","Inzicht in kwaliteit; Leren en verbeteren; inzicht in revisies die niet tot de keuzemogelijkheden behoren "]
["Waarde verplicht","Functioneel verplicht wanneer er ‘Andere type revisie’ geregistreerd is"]
["Datatype","Tekst (TXT) "]
["Domein (acceptabele range, min-max)"]
["Eenheid"]
["Format (max. lengte)",40]
["Decimalen"]
["Codering (EN/NL)"]
["Periode","Sinds start registratie"]
["Wijziging (datum en reden)"]
["Noodzakelijk voor kwaliteitsindicatoren","Nee"]
["Opmerkingen","Specificeerveld in tekst"]
["Zorg Informatie Bouwsteen (ZIB)","ZIB: \nContainer (1): \nContainer (2): \nDataelement: \nOmzetting naar LROI:"]
["Voorbeeld","<prosthesisOther>abcdedfgh</prosthesisOther>"]
[]
["Terug naar Overzicht"]

{"sheet":"Conversie naar totale heupproth","index":95,"n_rows":23,"n_cols":2,"rows_kept":23,"cut":false,"hidden":false,"merged":[]}
["DATA_ID",{"$f":"INDEX(Overzicht_unique!$A:$AJ, MATCH($B$2,Overzicht_unique!$A:$A,0), 36)","v":"LROI038"}]
["LROI uitvraag","Conversie naar totale heupprothese"]
["Variabelenaam XML","conversionToTotalHip"]
["Variabelenaam database","conversion_to_total"]
["Label EN","Conversion to total hip"]
["Label NL","Conversie naar totale heupprothese"]
["Definitie","Conversie van kophalsprothese of resurfacing prothese naar totale heupprothese"]
["Doel / reden uitvraag","Inzicht in kwaliteit en type revisie"]
["Waarde verplicht","Functioneel verplicht "]
["Datatype","Integer (INT)"]
["Domein (acceptabele range, min-max)"]
["Eenheid"]
["Format (max. lengte)"]
["Decimalen"]
["Codering (EN/NL)","0=No/ Nee\n1=Yes/ Ja"]
["Periode","Sinds start registratie"]
["Wijziging (datum en reden)"]
["Noodzakelijk voor kwaliteitsindicatoren","Nee"]
["Opmerkingen"]
["Zorg Informatie Bouwsteen (ZIB)","ZIB: \nContainer (1): \nContainer (2): \nDataelement:\nOmzetting naar LROI:"]
["Voorbeeld","<conversionToTotalHip>1</conversionToTotalHip>"]
[]
["Terug naar Overzicht"]

{"sheet":"Amputatie","index":96,"n_rows":23,"n_cols":2,"rows_kept":23,"cut":false,"hidden":false,"merged":[]}
["DATA_ID",{"$f":"INDEX(Overzicht_unique!$A:$AJ, MATCH($B$2,Overzicht_unique!$A:$A,0), 36)","v":"LROI134, LROI228, LROI310, LROI399, LROI492, LROI585"}]
["LROI uitvraag","Amputatie"]
["Variabelenaam XML","amputation"]
["Variabelenaam database","amputation"]
["Label EN","Amputation"]
["Label NL","Amputatie"]
["Definitie","Verwijdering van de gewrichtprothese veroorzaakt door amputatie boven de gewrichtsprothese"]
["Doel / reden uitvraag","Inzicht in kwaliteit en type revisie"]
["Waarde verplicht","Functioneel verplicht "]
["Datatype","Integer (INT)"]
["Domein (acceptabele range, min-max)"]
["Eenheid"]
["Format (max. lengte)"]
["Decimalen"]
["Codering (EN/NL)","0=No/ Nee\n1=Yes/ Ja"]
["Periode","Sinds start registratie (geldt niet voor knie)"]
["Wijziging (datum en reden)","Amputatie toegevoegd voor knie in LROI-ingrepen v5.1; 01-01-2022. "]
["Noodzakelijk voor kwaliteitsindicatoren","Nee"]
["Opmerkingen","Wordt vaak door een ander specialisme dan orthopedie uitgevoerd. Belangrijk om onderregistratie te voorkomen. "]
["Zorg Informatie Bouwsteen (ZIB)","ZIB: \nContainer (1): \nContainer (2): \nDataelement:\nOmzetting naar LROI:"]
["Voorbeeld","<amputation>1</amputation>"]
[]
["Terug naar Overzicht"]

{"sheet":"Conversie naar totale knieproth","index":97,"n_rows":23,"n_cols":2,"rows_kept":23,"cut":false,"hidden":false,"merged":[]}
["DATA_ID",{"$f":"INDEX(Overzicht_unique!$A:$AJ, MATCH($B$2,Overzicht_unique!$A:$A,0), 36)","v":"LROI135"}]
["LROI uitvraag","Conversie naar totale knieprothese"]
["Variabelenaam XML","conversionTotalKnee"]
["Variabelenaam database","conversion_to_total"]
["Label EN","Conversion to total knee"]
["Label NL","Conversie naar totale knieprothese"]
["Definitie","Conversie van unicondylaire knieprothese of patellofemorale knieprothese naar totale knieprothese"]
["Doel / reden uitvraag","Inzicht in kwaliteit en type revisie"]
["Waarde verplicht","Functioneel verplicht "]
["Datatype","Integer (INT)"]
["Domein (acceptabele range, min-max)"]
["Eenheid"]
["Format (max. lengte)"]
["Decimalen"]
["Codering (EN/NL)","0=No/ Nee\n1=Yes/ Ja"]
["Periode","Sinds start registratie"]
["Wijziging (datum en reden)"]
["Noodzakelijk voor kwaliteitsindicatoren","Nee"]
["Opmerkingen"]
["Zorg Informatie Bouwsteen (ZIB)","ZIB: \nContainer (1): \nContainer (2): \nDataelement:\nOmzetting naar LROI:"]
["Voorbeeld","<conversionToTotalKnee>1</conversionToTotalKnee>"]
[]
["Terug naar Overzicht"]

{"sheet":"Conversie van hemi_total schoud","index":98,"n_rows":23,"n_cols":2,"rows_kept":23,"cut":false,"hidden":false,"merged":[]}
["DATA_ID",{"$f":"INDEX(Overzicht_unique!$A:$AJ, MATCH($B$2,Overzicht_unique!$A:$A,0), 36)","v":"LROI311"}]
["LROI uitvraag","Conversie van hemi naar totale schouderprothese"]
["Variabelenaam XML","conversionHemiToTotal"]
["Variabelenaam database","conversion_hemi_to_total"]
["Label EN","Conversion hemi to total"]
["Label NL","Conversie van hemi naar totale schouderprothese"]
["Definitie","Conversie van hemi schouderprothese naar totale schouderprothese (anatomisch of reversed)"]
["Doel / reden uitvraag","Inzicht in kwaliteit en type revisie"]
["Waarde verplicht","Functioneel verplicht "]
["Datatype","Integer (INT)"]
["Domein (acceptabele range, min-max)"]
["Eenheid"]
["Format (max. lengte)"]
["Decimalen"]
["Codering (EN/NL)","0=No/ Nee\n1=Yes/ Ja"]
["Periode","Sinds start registratie"]
["Wijziging (datum en reden)"]
["Noodzakelijk voor kwaliteitsindicatoren","Nee"]
["Opmerkingen"]
["Zorg Informatie Bouwsteen (ZIB)","ZIB: \nContainer (1): \nContainer (2): \nDataelement:\nOmzetting naar LROI:"]
["Voorbeeld","<conversionHemiToTotal>1</conversionHemiToTotal>"]
[]
["Terug naar Overzicht"]

{"sheet":"Conversie van total_hemischoud","index":99,"n_rows":23,"n_cols":2,"rows_kept":23,"cut":false,"hidden":false,"merged":[]}
["DATA_ID",{"$f":"INDEX(Overzicht_unique!$A:$AJ, MATCH($B$2,Overzicht_unique!$A:$A,0), 36)","v":"LROI312"}]
["LROI uitvraag","Conversie van totale naar hemischouderprothese"]
["Variabelenaam XML","conversionTotalToHemi"]
["Variabelenaam database","conversion_total_to_hemi"]
["Label EN","Conversion total to hemi"]
["Label NL","Conversie van totale naar hemischouderprothese"]
["Definitie","Conversie van totale schouderprothese (anatomisch of reversed) naar hemi schouderprothese"]
["Doel / reden uitvraag","Inzicht in kwaliteit en type revisie"]
["Waarde verplicht","Functioneel verplicht "]
["Datatype","Integer (INT)"]
["Domein (acceptabele range, min-max)"]
["Eenheid"]
["Format (max. lengte)"]
["Decimalen"]
["Codering (EN/NL)","0=No/ Nee\n1=Yes/ Ja"]
["Periode","Sinds start registratie"]
["Wijziging (datum en reden)"]
["Noodzakelijk voor kwaliteitsindicatoren","Nee"]
["Opmerkingen"]
["Zorg Informatie Bouwsteen (ZIB)","ZIB: \nContainer (1): \nContainer (2): \nDataelement:\nOmzetting naar LROI:"]
["Voorbeeld","<conversionTotalToHemi>1</conversionTotalToHemi>"]
[]
["Terug naar Overzicht"]

{"sheet":"Conversie naar totale elleboog","index":100,"n_rows":23,"n_cols":2,"rows_kept":23,"cut":false,"hidden":false,"merged":[]}
["DATA_ID",{"$f":"INDEX(Overzicht_unique!$A:$AJ, MATCH($B$2,Overzicht_unique!$A:$A,0), 36)","v":"LROI400"}]
["LROI uitvraag","Conversie naar totale elleboogprothese"]
["Variabelenaam XML","conversionToTotalElbow"]
["Variabelenaam database","conversion_to_total"]
["Label EN","Conversion to total elbow"]
["Label NL","Conversie naar totale elleboogprothese"]
["Definitie","Conversie van radiusprothese naar totale elleboogprothese"]
["Doel / reden uitvraag","Inzicht in kwaliteit en type revisie"]
["Waarde verplicht","Functioneel verplicht "]
["Datatype","Integer (INT)"]
["Domein (acceptabele range, min-max)"]
["Eenheid"]
["Format (max. lengte)"]
["Decimalen"]
["Codering (EN/NL)","0=No/ Nee\n1=Yes/ Ja"]
["Periode","Sinds start registratie"]
["Wijziging (datum en reden)"]
["Noodzakelijk voor kwaliteitsindicatoren","Nee"]
["Opmerkingen"]
["Zorg Informatie Bouwsteen (ZIB)","ZIB: \nContainer (1): \nContainer (2): \nDataelement:\nOmzetting naar LROI:"]
["Voorbeeld","<conversionToTotalElbow>1</conversionToTotalElbow>"]
[]
["Terug naar Overzicht"]

{"sheet":"Patellacomponent bijgeplaats","index":101,"n_rows":23,"n_cols":2,"rows_kept":23,"cut":false,"hidden":false,"merged":[]}
["DATA_ID",{"$f":"INDEX(Overzicht_unique!$A:$AJ, MATCH($B$2,Overzicht_unique!$A:$A,0), 36)","v":"LROI136"}]
["LROI uitvraag","Patellacomponent (bij)geplaatst"]
["Variabelenaam XML","patellaComponent"]
["Variabelenaam database","patella_resurf(_r)"]
["Label EN","Patella component placed"]
["Label NL","Patellacomponent (bij)geplaatst"]
["Definitie","Patellacomponent (bij)geplaatst: Vul hier ‘ja’ in indien er een patellacomponent is geplaatst"]
["Doel / reden uitvraag","Inzicht in kwaliteit en type revisie"]
["Waarde verplicht","Functioneel verplicht "]
["Datatype","Integer (INT)"]
["Domein (acceptabele range, min-max)"]
["Eenheid"]
["Format (max. lengte)"]
["Decimalen"]
["Codering (EN/NL)","0=No/ Nee\n1=Yes/ Ja"]
["Periode","Sinds start registratie"]
["Wijziging (datum en reden)"]
["Noodzakelijk voor kwaliteitsindicatoren","Nee"]
["Opmerkingen"]
["Zorg Informatie Bouwsteen (ZIB)","ZIB: \nContainer (1): \nContainer (2): \nDataelement:\nOmzetting naar LROI:"]
["Voorbeeld","<patellaComponent>1</patellaComponent>"]
[]
["Terug naar Overzicht"]

{"sheet":"Unicompartimentele proth bijgep","index":102,"n_rows":23,"n_cols":2,"rows_kept":23,"cut":false,"hidden":false,"merged":[]}
["DATA_ID",{"$f":"INDEX(Overzicht_unique!$A:$AJ, MATCH($B$2,Overzicht_unique!$A:$A,0), 36)","v":"LROI137"}]
["LROI uitvraag","Unicompartimentele prothese  bijgeplaatst"]
["Variabelenaam XML","uniProsthesisAdded"]
["Variabelenaam database","uni_prosthesis_added"]
["Label EN","Unicompartmental prosthesis placed"]
["Label NL","Unicompartimentele prothese  bijgeplaatst"]
["Definitie","Er wordt een extra unicompartimentele prothese geplaatst"]
["Doel / reden uitvraag","Inzicht in kwaliteit en type revisie"]
["Waarde verplicht","Functioneel verplicht "]
["Datatype","Integer (INT)"]
["Domein (acceptabele range, min-max)"]
["Eenheid"]
["Format (max. lengte)"]
["Decimalen"]
["Codering (EN/NL)","0=No/ Nee\n1=Yes/ Ja"]
["Periode","Sinds LROI-ingrepen v5.1; 01-01-2022"]
["Wijziging (datum en reden)"]
["Noodzakelijk voor kwaliteitsindicatoren","Nee"]
["Opmerkingen"]
["Zorg Informatie Bouwsteen (ZIB)","ZIB: \nContainer (1): \nContainer (2): \nDataelement:\nOmzetting naar LROI:"]
["Voorbeeld","<uniProsthesisAdded>1</uniProsthesisAdded>"]
[]
["Terug naar Overzicht"]

{"sheet":"VKB functioneel intact","index":103,"n_rows":23,"n_cols":2,"rows_kept":23,"cut":false,"hidden":false,"merged":[]}
["DATA_ID",{"$f":"INDEX(Overzicht_unique!$A:$AJ, MATCH($B$2,Overzicht_unique!$A:$A,0), 36)","v":"LROI138"}]
["LROI uitvraag","VKB functioneel intact"]
["Variabelenaam XML","anteriorCrucLig"]
["Variabelenaam database","anterior_cruc_lig"]
["Label EN","Anterior cruciate ligament intact"]
["Label NL","VKB functioneel intact"]
["Definitie","VKB functioneel intact: Vul hier ‘ja’ in indien de kruisband nog functioneel is"]
["Doel / reden uitvraag","Inzicht in kwaliteit "]
["Waarde verplicht","Functioneel verplicht "]
["Datatype","Integer (INT)"]
["Domein (acceptabele range, min-max)"]
["Eenheid"]
["Format (max. lengte)"]
["Decimalen"]
["Codering (EN/NL)","0=No/ Nee\n1=Yes/ Ja"]
["Periode","Sinds LROI-ingrepen v5.1; 01-01-2022"]
["Wijziging (datum en reden)","Artrose patronen lijken van invloed op de resultaten van knieprotheses. Of de VKB intact is speelt hierbij een rol. Hierom kan het lonen vast te leggen of de VKB functioneel intact is."]
["Noodzakelijk voor kwaliteitsindicatoren","Nee"]
["Opmerkingen"]
["Zorg Informatie Bouwsteen (ZIB)","ZIB: \nContainer (1): \nContainer (2): \nDataelement:\nOmzetting naar LROI:"]
["Voorbeeld","<anteriorCrucLig>1</anteriorCrucLig>"]
[]
["Terug naar Overzicht"]

{"sheet":"Radiuskopresectie","index":104,"n_rows":23,"n_cols":2,"rows_kept":23,"cut":false,"hidden":false,"merged":[]}
["DATA_ID",{"$f":"INDEX(Overzicht_unique!$A:$AJ, MATCH($B$2,Overzicht_unique!$A:$A,0), 36)","v":"LROI401"}]
["LROI uitvraag","Radiuskopresectie"]
["Variabelenaam XML","radialHeadResection"]
["Variabelenaam database","radial_head_resection"]
["Label EN","Radial head resection"]
["Label NL","Radiuskopresectie"]
["Definitie","Het chirurgisch verwijderen van de radiuskop"]
["Doel / reden uitvraag","Inzicht in kwaliteit "]
["Waarde verplicht","Functioneel verplicht "]
["Datatype","Integer (INT)"]
["Domein (acceptabele range, min-max)"]
["Eenheid"]
["Format (max. lengte)"]
["Decimalen"]
["Codering (EN/NL)","0=No/ Nee\n1=Yes/ Ja"]
["Periode","Sinds LROI-ingrepen v5.1; 01-01-2022"]
["Wijziging (datum en reden)"]
["Noodzakelijk voor kwaliteitsindicatoren","Nee"]
["Opmerkingen"]
["Zorg Informatie Bouwsteen (ZIB)","ZIB: \nContainer (1): \nContainer (2): \nDataelement:\nOmzetting naar LROI:"]
["Voorbeeld","<radialHeadResection>1</radialHeadResection>"]
[]
["Terug naar Overzicht"]

{"sheet":"Linking ulnar cap","index":105,"n_rows":23,"n_cols":2,"rows_kept":23,"cut":false,"hidden":false,"merged":[]}
["DATA_ID",{"$f":"INDEX(Overzicht_unique!$A:$AJ, MATCH($B$2,Overzicht_unique!$A:$A,0), 36)","v":"LROI402"}]
["LROI uitvraag","Linking ulnar cap"]
["Variabelenaam XML","ulnarCap"]
["Variabelenaam database","ulnar_cap"]
["Label EN","Linking ulnar cap"]
["Label NL","Linking ulnar cap"]
["Definitie"]
["Doel / reden uitvraag","Inzicht in kwaliteit "]
["Waarde verplicht","Functioneel verplicht "]
["Datatype","Integer (INT)"]
["Domein (acceptabele range, min-max)"]
["Eenheid"]
["Format (max. lengte)"]
["Decimalen"]
["Codering (EN/NL)","1=Added new/Nieuw geplaatst\n2=Exchanged/Gewisseld\n3=Removed/Verwijderd"]
["Periode","Sinds start registratie; vóór 01-01-2022 andere uitvraag (zie opmerkingen)"]
["Wijziging (datum en reden)","Labels gewijzigd in LROI-ingrepen v5.1; 01-01-2022; voorheen 3 variabelen met Nee/Ja opties, gewijzigd naar 1 variabele (huidig). "]
["Noodzakelijk voor kwaliteitsindicatoren","Nee"]
["Opmerkingen","Voor 01-01-2022 uitgvraag aan de hand van drie variabelen (database: ulnar_cap_placed, ulnar_cap_changed, ulnar_cap_removed) met labels 0=No/Nee; 1=Yes/Ja"]
["Zorg Informatie Bouwsteen (ZIB)","ZIB: \nContainer (1): \nContainer (2): \nDataelement:\nOmzetting naar LROI:"]
["Voorbeeld","<ulnar_cap>3</ulnar_cap>"]
[]
["Terug naar Overzicht"]

{"sheet":"Acetabulumcomponent gerev","index":106,"n_rows":23,"n_cols":2,"rows_kept":23,"cut":false,"hidden":false,"merged":[]}
["DATA_ID",{"$f":"INDEX(Overzicht_unique!$A:$AJ, MATCH($B$2,Overzicht_unique!$A:$A,0), 36)","v":"LROI039"}]
["LROI uitvraag","Acetabulumcomponent gereviseerd"]
["Variabelenaam XML","acetabulumRevised"]
["Variabelenaam database","revd_acetabulum"]
["Label EN","Acetabular component revised"]
["Label NL","Acetabulumcomponent gereviseerd"]
["Definitie","Vul hier ‘ja’ in indien de acetabulum gereviseerd is"]
["Doel / reden uitvraag","Inzicht in kwaliteit en type (partiële) revisie"]
["Waarde verplicht","Functioneel verplicht "]
["Datatype","Integer (INT)"]
["Domein (acceptabele range, min-max)"]
["Eenheid"]
["Format (max. lengte)"]
["Decimalen"]
["Codering (EN/NL)","0=No/ Nee\n1=Yes/ Ja"]
["Periode","Sinds start registratie"]
["Wijziging (datum en reden)"]
["Noodzakelijk voor kwaliteitsindicatoren","Nee"]
["Opmerkingen"]
["Zorg Informatie Bouwsteen (ZIB)","ZIB: Verrichting\nContainer (1): MedischHulpmiddel::MedischHulpmiddel\nContainer (2): Product\nDataelement: ProductID; VerrichtingType\nOmzetting naar LROI:"]
["Voorbeeld","<acetabulumRevised>1</acetabulumRevised>"]
[]
["Terug naar Overzicht"]

{"sheet":"Inlay_lager gereviseerd","index":107,"n_rows":23,"n_cols":2,"rows_kept":23,"cut":false,"hidden":false,"merged":[]}
["DATA_ID",{"$f":"INDEX(Overzicht_unique!$A:$AJ, MATCH($B$2,Overzicht_unique!$A:$A,0), 36)","v":"LROI040"}]
["LROI uitvraag","Inlay/lager gereviseerd"]
["Variabelenaam XML","inlayRevised"]
["Variabelenaam database","revd_inlay"]
["Label EN","Inlay/bearing revised"]
["Label NL","Inlay/lager gereviseerd"]
["Definitie","Vul hier ‘ja’ in indien de inlay/lager gereviseerd is"]
["Doel / reden uitvraag","Inzicht in kwaliteit en type (partiële) revisie"]
["Waarde verplicht","Functioneel verplicht "]
["Datatype","Integer (INT)"]
["Domein (acceptabele range, min-max)"]
["Eenheid"]
["Format (max. lengte)"]
["Decimalen"]
["Codering (EN/NL)","0=No/ Nee\n1=Yes/ Ja"]
["Periode","Sinds start registratie"]
["Wijziging (datum en reden)"]
["Noodzakelijk voor kwaliteitsindicatoren","Nee"]
["Opmerkingen"]
["Zorg Informatie Bouwsteen (ZIB)","ZIB: Verrichting\nContainer (1): MedischHulpmiddel::MedischHulpmiddel\nContainer (2): Product\nDataelement: ProductID; VerrichtingType\nOmzetting naar LROI:"]
["Voorbeeld","<inlayRevised>1</inlayRevised>"]
[]
["Terug naar Overzicht"]

{"sheet":"Femurkopcomponent gereviseerd","index":108,"n_rows":23,"n_cols":2,"rows_kept":23,"cut":false,"hidden":false,"merged":[]}
["DATA_ID",{"$f":"INDEX(Overzicht_unique!$A:$AJ, MATCH($B$2,Overzicht_unique!$A:$A,0), 36)","v":"LROI041"}]
["LROI uitvraag","Femurkopcomponent gereviseerd"]
["Variabelenaam XML","headRevised"]
["Variabelenaam database","revd_femoralhead"]
["Label EN","Femoral head component revised"]
["Label NL","Femurkopcomponent gereviseerd"]
["Definitie","Vul hier ‘ja’ in indien de femurkopcomponent gereviseerd is"]
["Doel / reden uitvraag","Inzicht in kwaliteit en type (partiële) revisie"]
["Waarde verplicht","Functioneel verplicht "]
["Datatype","Integer (INT)"]
["Domein (acceptabele range, min-max)"]
["Eenheid"]
["Format (max. lengte)"]
["Decimalen"]
["Codering (EN/NL)","0=No/ Nee\n1=Yes/ Ja"]
["Periode","Sinds start registratie"]
["Wijziging (datum en reden)"]
["Noodzakelijk voor kwaliteitsindicatoren","Nee"]
["Opmerkingen"]
["Zorg Informatie Bouwsteen (ZIB)","ZIB: Verrichting\nContainer (1): MedischHulpmiddel::MedischHulpmiddel\nContainer (2): Product\nDataelement: ProductID; VerrichtingType\nOmzetting naar LROI:"]
["Voorbeeld","<headRevised>1</headRevised>"]
[]
["Terug naar Overzicht"]

{"sheet":"Femurcomponent gereviseerd","index":109,"n_rows":23,"n_cols":2,"rows_kept":23,"cut":false,"hidden":false,"merged":[]}
["DATA_ID",{"$f":"INDEX(Overzicht_unique!$A:$AJ, MATCH($B$2,Overzicht_unique!$A:$A,0), 36)","v":"LROI042, LROI139"}]
["LROI uitvraag","Femurcomponent gereviseerd"]
["Variabelenaam XML","femurRevised"]
["Variabelenaam database","revd_femur"]
["Label EN","Femoral component revised"]
["Label NL","Femurcomponent gereviseerd"]
["Definitie","Vul hier ‘ja’ in indien de femurcomponent gereviseerd is"]
["Doel / reden uitvraag","Inzicht in kwaliteit en type (partiële) revisie"]
["Waarde verplicht","Functioneel verplicht "]
["Datatype","Integer (INT)"]
["Domein (acceptabele range, min-max)"]
["Eenheid"]
["Format (max. lengte)"]
["Decimalen"]
["Codering (EN/NL)","0=No/ Nee\n1=Yes/ Ja"]
["Periode","Sinds start registratie"]
["Wijziging (datum en reden)"]
["Noodzakelijk voor kwaliteitsindicatoren","Nee"]
["Opmerkingen"]
["Zorg Informatie Bouwsteen (ZIB)","ZIB: Verrichting\nContainer (1): MedischHulpmiddel::MedischHulpmiddel\nContainer (2): Product\nDataelement: ProductID; VerrichtingType\nOmzetting naar LROI:"]
["Voorbeeld","<femurRevised>1</femurRevised>"]
[]
["Terug naar Overzicht"]

{"sheet":"Tibiacomponent gereviseerd","index":110,"n_rows":23,"n_cols":2,"rows_kept":23,"cut":false,"hidden":false,"merged":[]}
["DATA_ID",{"$f":"INDEX(Overzicht_unique!$A:$AJ, MATCH($B$2,Overzicht_unique!$A:$A,0), 36)","v":"LROI140, LROI229"}]
["LROI uitvraag","Tibiacomponent gereviseerd"]
["Variabelenaam XML","tibiaRevised"]
["Variabelenaam database","revd_tibia"]
["Label EN","Tibial component revised"]
["Label NL","Tibiacomponent gereviseerd"]
["Definitie","Vul hier ‘ja’ in indien de tibiacomponent gereviseerd is"]
["Doel / reden uitvraag","Inzicht in kwaliteit en type (partiële) revisie"]
["Waarde verplicht","Functioneel verplicht "]
["Datatype","Integer (INT)"]
["Domein (acceptabele range, min-max)"]
["Eenheid"]
["Format (max. lengte)"]
["Decimalen"]
["Codering (EN/NL)","0=No/ Nee\n1=Yes/ Ja"]
["Periode","Sinds start registratie"]
["Wijziging (datum en reden)"]
["Noodzakelijk voor kwaliteitsindicatoren","Nee"]
["Opmerkingen"]
["Zorg Informatie Bouwsteen (ZIB)","ZIB: Verrichting\nContainer (1): MedischHulpmiddel::MedischHulpmiddel\nContainer (2): Product\nDataelement: ProductID; VerrichtingType\nOmzetting naar LROI:"]
["Voorbeeld","<tibiaRevised>1</tibiaRevised>"]
[]
["Terug naar Overzicht"]

{"sheet":"Inlay gereviseerd","index":111,"n_rows":23,"n_cols":2,"rows_kept":23,"cut":false,"hidden":false,"merged":[]}
["DATA_ID",{"$f":"INDEX(Overzicht_unique!$A:$AJ, MATCH($B$2,Overzicht_unique!$A:$A,0), 36)","v":"LROI141, LROI231, LROI495"}]
["LROI uitvraag","Inlay gereviseerd"]
["Variabelenaam XML","inlayRevised"]
["Variabelenaam database","revd_inlay"]
["Label EN","Inlay component revised"]
["Label NL","Inlay gereviseerd"]
["Definitie","Vul hier ‘ja’ in indien de inlay gereviseerd is"]
["Doel / reden uitvraag","Inzicht in kwaliteit en type (partiële) revisie"]
["Waarde verplicht","Functioneel verplicht "]
["Datatype","Integer (INT)"]
["Domein (acceptabele range, min-max)"]
["Eenheid"]
["Format (max. lengte)"]
["Decimalen"]
["Codering (EN/NL)","0=No/ Nee\n1=Yes/ Ja"]
["Periode","Sinds start registratie"]
["Wijziging (datum en reden)"]
["Noodzakelijk voor kwaliteitsindicatoren","Nee"]
["Opmerkingen"]
["Zorg Informatie Bouwsteen (ZIB)","ZIB: Verrichting\nContainer (1): MedischHulpmiddel::MedischHulpmiddel\nContainer (2): Product\nDataelement: ProductID; VerrichtingType\nOmzetting naar LROI:"]
["Voorbeeld","<inlayRevised>1</inlayRevised>"]
[]
["Terug naar Overzicht"]

{"sheet":"Patellacomponent gereviseerd","index":112,"n_rows":23,"n_cols":2,"rows_kept":23,"cut":false,"hidden":false,"merged":[]}
["DATA_ID",{"$f":"INDEX(Overzicht_unique!$A:$AJ, MATCH($B$2,Overzicht_unique!$A:$A,0), 36)","v":"LROI142"}]
["LROI uitvraag","Patellacomponent gereviseerd"]
["Variabelenaam XML","patellaRevised"]
["Variabelenaam database","revd_patella"]
["Label EN","Patellar component revised"]
["Label NL","Patellacomponent gereviseerd"]
["Definitie","Vul hier ‘ja’ in indien de patella gereviseerd is"]
["Doel / reden uitvraag","Inzicht in kwaliteit en type (partiële) revisie"]
["Waarde verplicht","Functioneel verplicht "]
["Datatype","Integer (INT)"]
["Domein (acceptabele range, min-max)"]
["Eenheid"]
["Format (max. lengte)"]
["Decimalen"]
["Codering (EN/NL)","0=No/ Nee\n1=Yes/ Ja"]
["Periode","Sinds start registratie"]
["Wijziging (datum en reden)"]
["Noodzakelijk voor kwaliteitsindicatoren","Nee"]
["Opmerkingen"]
["Zorg Informatie Bouwsteen (ZIB)","ZIB: Verrichting\nContainer (1): MedischHulpmiddel::MedischHulpmiddel\nContainer (2): Product\nDataelement: ProductID; VerrichtingType\nOmzetting naar LROI:"]
["Voorbeeld","<patellaRevised>1</patellaRevised>"]
[]
["Terug naar Overzicht"]

{"sheet":"Taluscomponent gereviseerd","index":113,"n_rows":23,"n_cols":2,"rows_kept":23,"cut":false,"hidden":false,"merged":[]}
["DATA_ID",{"$f":"INDEX(Overzicht_unique!$A:$AJ, MATCH($B$2,Overzicht_unique!$A:$A,0), 36)","v":"LROI230"}]
["LROI uitvraag","Taluscomponent gereviseerd"]
["Variabelenaam XML","talusRevised"]
["Variabelenaam database","revd_talus"]
["Label EN","Talar component revised"]
["Label NL","Taluscomponent gereviseerd"]
["Definitie","Vul hier ‘ja’ in indien de taluscomponent gereviseerd is"]
["Doel / reden uitvraag","Inzicht in kwaliteit en type revisie"]
["Waarde verplicht","Functioneel verplicht "]
["Datatype","Integer (INT)"]
["Domein (acceptabele range, min-max)"]
["Eenheid"]
["Format (max. lengte)"]
["Decimalen"]
["Codering (EN/NL)","0=No/ Nee\n1=Yes/ Ja"]
["Periode","Sinds start registratie"]
["Wijziging (datum en reden)"]
["Noodzakelijk voor kwaliteitsindicatoren","Nee"]
["Opmerkingen"]
["Zorg Informatie Bouwsteen (ZIB)","ZIB: Verrichting\nContainer (1): MedischHulpmiddel::MedischHulpmiddel\nContainer (2): Product\nDataelement: ProductID; VerrichtingType\nOmzetting naar LROI:"]
["Voorbeeld","<talusRevised>1</talusRevised>"]
[]
["Terug naar Overzicht"]

{"sheet":"Humeruscomponent gereviseerd","index":114,"n_rows":23,"n_cols":2,"rows_kept":23,"cut":false,"hidden":false,"merged":[]}
["DATA_ID",{"$f":"INDEX(Overzicht_unique!$A:$AJ, MATCH($B$2,Overzicht_unique!$A:$A,0), 36)","v":"LROI313, LROI403"}]
["LROI uitvraag","Humeruscomponent gereviseerd"]
["Variabelenaam XML","humerusRevised"]
["Variabelenaam database","revd_humeralstem"]
["Label EN","Humeral component revised"]
["Label NL","Humeruscomponent gereviseerd"]
["Definitie","Vul hier ‘ja’ in indien de humeruscomponent gereviseerd is"]
["Doel / reden uitvraag","Inzicht in kwaliteit en type revisie"]
["Waarde verplicht","Functioneel verplicht "]
["Datatype","Integer (INT)"]
["Domein (acceptabele range, min-max)"]
["Eenheid"]
["Format (max. lengte)"]
["Decimalen"]
["Codering (EN/NL)","0=No/ Nee\n1=Yes/ Ja"]
["Periode","Sinds start registratie"]
["Wijziging (datum en reden)"]
["Noodzakelijk voor kwaliteitsindicatoren","Nee"]
["Opmerkingen"]
["Zorg Informatie Bouwsteen (ZIB)","ZIB: Verrichting\nContainer (1): MedischHulpmiddel::MedischHulpmiddel\nContainer (2): Product\nDataelement: ProductID; VerrichtingType\nOmzetting naar LROI:"]
["Voorbeeld","<humerusRevised>1</humerusRevised>"]
[]
["Terug naar Overzicht"]

{"sheet":"Humeruskop_humerale liner gerev","index":115,"n_rows":23,"n_cols":2,"rows_kept":23,"cut":false,"hidden":false,"merged":[]}
["DATA_ID",{"$f":"INDEX(Overzicht_unique!$A:$AJ, MATCH($B$2,Overzicht_unique!$A:$A,0), 36)","v":"LROI314"}]
["LROI uitvraag","Humeruskop/humerale liner gereviseerd"]
["Variabelenaam XML","humeralHeadRevised"]
["Variabelenaam database","revd_humeralhead_inl"]
["Label EN","Humeral head/humeral liner revised"]
["Label NL","Humeruskop/humerale liner gereviseerd"]
["Definitie","Vul hier ‘ja’ in indien de humeruskop/humerale liner gereviseerd is"]
["Doel / reden uitvraag","Inzicht in kwaliteit en type revisie"]
["Waarde verplicht","Functioneel verplicht "]
["Datatype","Integer (INT)"]
["Domein (acceptabele range, min-max)"]
["Eenheid"]
["Format (max. lengte)"]
["Decimalen"]
["Codering (EN/NL)","0=No/ Nee\n1=Yes/ Ja"]
["Periode","Sinds start registratie"]
["Wijziging (datum en reden)"]
["Noodzakelijk voor kwaliteitsindicatoren","Nee"]
["Opmerkingen"]
["Zorg Informatie Bouwsteen (ZIB)","ZIB: Verrichting\nContainer (1): MedischHulpmiddel::MedischHulpmiddel\nContainer (2): Product\nDataelement: ProductID; VerrichtingType\nOmzetting naar LROI:"]
["Voorbeeld","<humeralHeadRevised>1</humeralHeadRevised>"]
[]
["Terug naar Overzicht"]

{"sheet":"Glenoïdcup_glenosfeer gerev","index":116,"n_rows":23,"n_cols":2,"rows_kept":23,"cut":false,"hidden":false,"merged":[]}
["DATA_ID",{"$f":"INDEX(Overzicht_unique!$A:$AJ, MATCH($B$2,Overzicht_unique!$A:$A,0), 36)","v":"LROI315"}]
["LROI uitvraag","Glenoïdcup/glenosfeer gereviseerd"]
["Variabelenaam XML","glenoidCupGlenosphereRevised"]
["Variabelenaam database","revd_glen_sph"]
["Label EN","Glenoid cup/glenosphere revised"]
["Label NL","Glenoïdcup/glenosfeer gereviseerd"]
["Definitie","Vul hier ‘ja’ in indien de glenoïdcup/glenosfeer gereviseerd is"]
["Doel / reden uitvraag","Inzicht in kwaliteit en type revisie"]
["Waarde verplicht","Functioneel verplicht "]
["Datatype","Integer (INT)"]
["Domein (acceptabele range, min-max)"]
["Eenheid"]
["Format (max. lengte)"]
["Decimalen"]
["Codering (EN/NL)","0=No/ Nee\n1=Yes/ Ja"]
["Periode","Sinds start registratie"]
["Wijziging (datum en reden)"]
["Noodzakelijk voor kwaliteitsindicatoren","Nee"]
["Opmerkingen"]
["Zorg Informatie Bouwsteen (ZIB)","ZIB: Verrichting\nContainer (1): MedischHulpmiddel::MedischHulpmiddel\nContainer (2): Product\nDataelement: ProductID; VerrichtingType\nOmzetting naar LROI:"]
["Voorbeeld","<glenoidCupGlenosphereRevised>1</glenoidCupGlenosphereRevised>"]
[]
["Terug naar Overzicht"]

{"sheet":"Metafyse_taper gereviseerd","index":117,"n_rows":23,"n_cols":2,"rows_kept":23,"cut":false,"hidden":false,"merged":[]}
["DATA_ID",{"$f":"INDEX(Overzicht_unique!$A:$AJ, MATCH($B$2,Overzicht_unique!$A:$A,0), 36)","v":"LROI316"}]
["LROI uitvraag","Metafyse/taper gereviseerd"]
["Variabelenaam XML","metaphysisTaperRevised"]
["Variabelenaam database","revd_metahpysis_taper"]
["Label EN","Metaphysis/taper revised"]
["Label NL","Metafyse/taper gereviseerd"]
["Definitie","Vul hier ‘ja’ in indien de metafyse/taper  gereviseerd is"]
["Doel / reden uitvraag","Inzicht in kwaliteit en type revisie"]
["Waarde verplicht","Functioneel verplicht "]
["Datatype","Integer (INT)"]
["Domein (acceptabele range, min-max)"]
["Eenheid"]
["Format (max. lengte)"]
["Decimalen"]
["Codering (EN/NL)","0=No/ Nee\n1=Yes/ Ja"]
["Periode","Sinds start registratie"]
["Wijziging (datum en reden)"]
["Noodzakelijk voor kwaliteitsindicatoren","Nee"]
["Opmerkingen"]
["Zorg Informatie Bouwsteen (ZIB)","ZIB: Verrichting\nContainer (1): MedischHulpmiddel::MedischHulpmiddel\nContainer (2): Product\nDataelement: ProductID; VerrichtingType\nOmzetting naar LROI:"]
["Voorbeeld","<metaphysisTaperRevised>1</metaphysisTaperRevised>"]
[]
["Terug naar Overzicht"]

{"sheet":"Glenoïd liner_baseplate gerev","index":118,"n_rows":23,"n_cols":2,"rows_kept":23,"cut":false,"hidden":false,"merged":[]}
["DATA_ID",{"$f":"INDEX(Overzicht_unique!$A:$AJ, MATCH($B$2,Overzicht_unique!$A:$A,0), 36)","v":"LROI317"}]
["LROI uitvraag","Glenoïd liner/baseplate gereviseerd"]
["Variabelenaam XML","glenoidLinerBaseplateRevised"]
["Variabelenaam database","revd_glenbase_inl"]
["Label EN","Glenoid liner/baseplate revised"]
["Label NL","Glenoïd liner/baseplate gereviseerd"]
["Definitie","Vul hier ‘ja’ in indien de glenoïd liner/baseplate  gereviseerd is"]
["Doel / reden uitvraag","Inzicht in kwaliteit en type revisie"]
["Waarde verplicht","Functioneel verplicht "]
["Datatype","Integer (INT)"]
["Domein (acceptabele range, min-max)"]
["Eenheid"]
["Format (max. lengte)"]
["Decimalen"]
["Codering (EN/NL)","0=No/ Nee\n1=Yes/ Ja"]
["Periode","Sinds start registratie"]
["Wijziging (datum en reden)"]
["Noodzakelijk voor kwaliteitsindicatoren","Nee"]
["Opmerkingen"]
["Zorg Informatie Bouwsteen (ZIB)","ZIB: Verrichting\nContainer (1): MedischHulpmiddel::MedischHulpmiddel\nContainer (2): Product\nDataelement: ProductID; VerrichtingType\nOmzetting naar LROI:"]
["Voorbeeld","<glenoidLinerBaseplateRevised>1</glenoidLinerBaseplateRevised>"]
[]
["Terug naar Overzicht"]

{"sheet":"Radiuscomponent gereviseerd","index":119,"n_rows":23,"n_cols":2,"rows_kept":23,"cut":false,"hidden":false,"merged":[]}
["DATA_ID",{"$f":"INDEX(Overzicht_unique!$A:$AJ, MATCH($B$2,Overzicht_unique!$A:$A,0), 36)","v":"LROI405, LROI493"}]
["LROI uitvraag","Radiuscomponent gereviseerd"]
["Variabelenaam XML","radiusRevised"]
["Variabelenaam database","revd_radius"]
["Label EN","Radial component revised"]
["Label NL","Radiuscomponent gereviseerd"]
["Definitie","Vul hier ‘ja’ in indien de radiuscomponent gereviseerd is"]
["Doel / reden uitvraag","Inzicht in kwaliteit en type revisie"]
["Waarde verplicht","Functioneel verplicht "]
["Datatype","Integer (INT)"]
["Domein (acceptabele range, min-max)"]
["Eenheid"]
["Format (max. lengte)"]
["Decimalen"]
["Codering (EN/NL)","0=No/ Nee\n1=Yes/ Ja"]
["Periode","Sinds start registratie"]
["Wijziging (datum en reden)"]
["Noodzakelijk voor kwaliteitsindicatoren","Nee"]
["Opmerkingen"]
["Zorg Informatie Bouwsteen (ZIB)","ZIB: Verrichting\nContainer (1): MedischHulpmiddel::MedischHulpmiddel\nContainer (2): Product\nDataelement: ProductID; VerrichtingType\nOmzetting naar LROI:"]
["Voorbeeld","<radiusRevised>1</radiusRevised>"]
[]
["Terug naar Overzicht"]

{"sheet":"Ulnacomponent gereviseerd","index":120,"n_rows":23,"n_cols":2,"rows_kept":23,"cut":false,"hidden":false,"merged":[]}
["DATA_ID",{"$f":"INDEX(Overzicht_unique!$A:$AJ, MATCH($B$2,Overzicht_unique!$A:$A,0), 36)","v":"LROI404, LROI494"}]
["LROI uitvraag","Ulnacomponent gereviseerd"]
["Variabelenaam XML","ulnaRevised"]
["Variabelenaam database","revd_ulna"]
["Label EN","Ulnar component revised"]
["Label NL","Ulnacomponent gereviseerd"]
["Definitie","Vul hier ‘ja’ in indien de ulnacomponent gereviseerd is"]
["Doel / reden uitvraag","Inzicht in kwaliteit en type revisie"]
["Waarde verplicht","Functioneel verplicht "]
["Datatype","Integer (INT)"]
["Domein (acceptabele range, min-max)"]
["Eenheid"]
["Format (max. lengte)"]
["Decimalen"]
["Codering (EN/NL)","0=No/ Nee\n1=Yes/ Ja"]
["Periode","Sinds start registratie"]
["Wijziging (datum en reden)"]
["Noodzakelijk voor kwaliteitsindicatoren","Nee"]
["Opmerkingen"]
["Zorg Informatie Bouwsteen (ZIB)","ZIB: Verrichting\nContainer (1): MedischHulpmiddel::MedischHulpmiddel\nContainer (2): Product\nDataelement: ProductID; VerrichtingType\nOmzetting naar LROI:"]
["Voorbeeld","<ulnaRevised>1</ulnaRevised>"]
[]
["Terug naar Overzicht"]

{"sheet":"Carpaalcomponent gereviseerd","index":121,"n_rows":23,"n_cols":2,"rows_kept":23,"cut":false,"hidden":false,"merged":[]}
["DATA_ID",{"$f":"INDEX(Overzicht_unique!$A:$AJ, MATCH($B$2,Overzicht_unique!$A:$A,0), 36)","v":"LROI496"}]
["LROI uitvraag","Carpaalcomponent gereviseerd"]
["Variabelenaam XML","carpalRevised "]
["Variabelenaam database","revd_carpals"]
["Label EN","Carpal component revised"]
["Label NL","Carpaalcomponent gereviseerd"]
["Definitie","Vul hier ‘ja’ in indien de carpaalcomponent(en) gereviseerd is"]
["Doel / reden uitvraag","Inzicht in kwaliteit en type revisie"]
["Waarde verplicht","Functioneel verplicht "]
["Datatype","Integer (INT)"]
["Domein (acceptabele range, min-max)"]
["Eenheid"]
["Format (max. lengte)"]
["Decimalen"]
["Codering (EN/NL)","0=No/ Nee\n1=Yes/ Ja"]
["Periode","Sinds start registratie"]
["Wijziging (datum en reden)"]
["Noodzakelijk voor kwaliteitsindicatoren","Nee"]
["Opmerkingen"]
["Zorg Informatie Bouwsteen (ZIB)","ZIB: Verrichting\nContainer (1): MedischHulpmiddel::MedischHulpmiddel\nContainer (2): Product\nDataelement: ProductID; VerrichtingType\nOmzetting naar LROI:"]
["Voorbeeld","<carpalRevised>1</carpalRevised>"]
[]
["Terug naar Overzicht"]

{"sheet":"Proximale component gerev","index":122,"n_rows":23,"n_cols":2,"rows_kept":23,"cut":false,"hidden":false,"merged":[]}
["DATA_ID",{"$f":"INDEX(Overzicht_unique!$A:$AJ, MATCH($B$2,Overzicht_unique!$A:$A,0), 36)","v":"LROI586"}]
["LROI uitvraag","Proximale component gereviseerd"]
["Variabelenaam XML","proximalComponentRevised"]
["Variabelenaam database","revd_prox_comp"]
["Label EN","Proximal component revised"]
["Label NL","Proximale component gereviseerd"]
["Definitie","Vul hier ‘ja’ in indien de proximale component(en) gereviseerd is"]
["Doel / reden uitvraag","Inzicht in kwaliteit en type revisie"]
["Waarde verplicht","Functioneel verplicht "]
["Datatype","Integer (INT)"]
["Domein (acceptabele range, min-max)"]
["Eenheid"]
["Format (max. lengte)"]
["Decimalen"]
["Codering (EN/NL)","0=No/ Nee\n1=Yes/ Ja"]
["Periode","Sinds start registratie"]
["Wijziging (datum en reden)"]
["Noodzakelijk voor kwaliteitsindicatoren","Nee"]
["Opmerkingen"]
["Zorg Informatie Bouwsteen (ZIB)","ZIB: Verrichting\nContainer (1): MedischHulpmiddel::MedischHulpmiddel\nContainer (2): Product\nDataelement: ProductID; VerrichtingType\nOmzetting naar LROI:"]
["Voorbeeld","<proximalComponentRevised>1</proximalComponentRevised>"]
[]
["Terug naar Overzicht"]

{"sheet":"Distale component gereviseerd","index":123,"n_rows":23,"n_cols":2,"rows_kept":23,"cut":false,"hidden":false,"merged":[]}
["DATA_ID",{"$f":"INDEX(Overzicht_unique!$A:$AJ, MATCH($B$2,Overzicht_unique!$A:$A,0), 36)","v":"LROI587"}]
["LROI uitvraag","Distale component gereviseerd"]
["Variabelenaam XML","distalComponentRevised"]
["Variabelenaam database","revd_dist_comp"]
["Label EN","Distal component revised"]
["Label NL","Distale component gereviseerd"]
["Definitie","Vul hier ‘ja’ in indien de distale component(en) gereviseerd is"]
["Doel / reden uitvraag","Inzicht in kwaliteit en type revisie"]
["Waarde verplicht","Functioneel verplicht "]
["Datatype","Integer (INT)"]
["Domein (acceptabele range, min-max)"]
["Eenheid"]
["Format (max. lengte)"]
["Decimalen"]
["Codering (EN/NL)","0=No/ Nee\n1=Yes/ Ja"]
["Periode","Sinds start registratie"]
["Wijziging (datum en reden)"]
["Noodzakelijk voor kwaliteitsindicatoren","Nee"]
["Opmerkingen"]
["Zorg Informatie Bouwsteen (ZIB)","ZIB: Verrichting\nContainer (1): MedischHulpmiddel::MedischHulpmiddel\nContainer (2): Product\nDataelement: ProductID; VerrichtingType\nOmzetting naar LROI:"]
["Voorbeeld","<distalComponentRevised>1</distalComponentRevised>"]
[]
["Terug naar Overzicht"]

{"sheet":"Benadering","index":124,"n_rows":23,"n_cols":2,"rows_kept":23,"cut":false,"hidden":false,"merged":[]}
["DATA_ID",{"$f":"INDEX(Overzicht_unique!$A:$AJ, MATCH($B$2,Overzicht_unique!$A:$A,0), 36)","v":"LROI046, LROI145, LROI234, LROI318, LROI406, LROI500, LROI591"}]
["LROI uitvraag","Benadering"]
["Variabelenaam XML","approach"]
["Variabelenaam database","approach"]
["Label EN","Approach"]
["Label NL","Benadering"]
["Definitie","De verrichtingsmethode. Bij het plaatsen van een gewrichtsprothese zijn er voor de chirurg verschillende mogelijkheden om bij het gewricht te komen. "]
["Doel / reden uitvraag","Inzicht in kwaliteit; Kwaliteitsindicator 5b.Volledigheid registratie LROI. Volledig operatie-record: Ingrepen waarbij alle items die nodig zijn voor het berekenen van de externe indicatoren ingevuld zijn. Hieronder vallen: geslacht, geëncrypteerd BSN, geboortedatum, diagnose, ASA score, BMI, Charnley score, roken, datum van operatie, kant van operatie, type prothese, benadering, fixatie en soort prothese."]
["Waarde verplicht","Functioneel verplicht "]
["Datatype","Integer (INT)"]
["Domein (acceptabele range, min-max)"]
["Eenheid"]
["Format (max. lengte)"]
["Decimalen"]
["Codering (EN/NL)","Heup:\n0=Straight lateral/Direct lateraal\n1=Posterolateral/Posterolateraal\n2=Anterolateral\t/Anterolateraal\n3=Anterior/Anterieur\n5=Direct superior/Direct superieur\n99=Other approach, specify/Andere benadering, specificeer\nKnie: \n0=Medial parapatellar/Mediaal parapatellair\n1=Lateral parapatellar/Lateraal parapatellair\n2=Vastus (mid/sub)/Vastus (mid/sub)\n99=Other approach, specify/Andere benadering, specificeer\nEnkel:\n1=Lateral/Lateraal\n99=Other approach, specify/Andere benadering, specificeer\nSchouder:\n0=Deltopectoral/Deltopectoraal\n1=Anterosuperior / superolateral/Anterosuperieur/ superolateraal\n99=Other approach, specify/Andere benadering, specificeer\nElleboog:\n3=Posterior, Triceps-on/Posterieur, Triceps-on\n4=Posterior, Triceps-split/Posterieur, Tricepes-split\n5=Posterior, Triceps-flap/Posterieur, Triceps-flap\n6=Posterior, Osteotomy olecranon/Posterieur, Osteotomie van het olecranon\n7=Posterolateral (Kocher)/Posterolateraal (Kocher)\n8=Extensor split (Kaplan)/Extensor split (Kaplan)\n9=Posterior, Boyd/Posterieur, Boyd\n99=Other approach, specify/Andere benadering, specificeer\nPols:\n1=Dorsal/Dorsaal\n2=Ulnar\t/Ulnair\n3=Combined (multiple incisions)\t/Gecombineerd (meerdere incisies)\n99=Other approach, specify/Andere benadering, specificeer\nVinger: \n1=Dorsal/Dorsaal\n2=Volar/Volair\n3=Lateral/Lateraal\n99=Other approach, specify/Andere benadering, specificeer"]
["Periode","Sinds start registratie"]
["Wijziging (datum en reden)","Heup: \"Trochanter osteotomie\" verwijderd en \"DSA Direct Superieure Benadering\" toegevoegd in LROI-ingrepen v5.1; 01-01-2022. Reden: Trochanter osteotomie is geen benadering op zich maar kan onderdeel zijn van verschillende benaderingen. Als hiermee de Ollier bedoeld wordt dan zou ik hem ook weglaten aangezien dit geen gangbare benadering is voor een THP. DSA (Direct Superieure Benadering), een toenemend gebruikte aanpassing van de posterolaterale benadering. Wellicht daaronder te scharen, maar gezien mogelijke invloed op luxatierisico toch apart te identificeren.\nSchouder: naamswijziging: “Anterosuperieur (incl. losmaken M. deltoideus)” is vervangen door “Anterosuperieur/ superolateraal” in LROI-ingrepen v5.1; 01-01-2022.\nElleboog: \"LCL losgemaakt ja/nee\" verwijderd en als aparte variabele toegevoegd. \"Posterolateraal (Kocher)\", \"Extensor split (Kaplan)\" en \"Posterieur, Boyd\" toegevoegd in LROI-ingrepen v5.1; 01-01-2022.\nPols: \"Ulnair\" en \"Gecombineerd (meerdere incisies)\" toegevoegd in LROI-ingrepen v5.1; 01-01-2022."]
["Noodzakelijk voor kwaliteitsindicatoren","Ja"]
["Opmerkingen"]
["Zorg Informatie Bouwsteen (ZIB)","ZIB: Verrichting\nContainer (1): \nContainer (2): \nDataelement: VerrichtingMethode\nOmzetting naar LROI:"]
["Voorbeeld","<approach>1</approach>"]
[]
["Terug naar Overzicht"]

{"sheet":"Andere benadering, specificeer","index":125,"n_rows":23,"n_cols":2,"rows_kept":23,"cut":false,"hidden":false,"merged":[]}
["DATA_ID",{"$f":"INDEX(Overzicht_unique!$A:$AJ, MATCH($B$2,Overzicht_unique!$A:$A,0), 36)","v":"LROI047, LROI146, LROI235, LROI319, LROI407, LROI501, LROI592"}]
["LROI uitvraag","Andere benadering, specificeer"]
["Variabelenaam XML","approachOther"]
["Variabelenaam database","approach_other"]
["Label EN","Approach, specify"]
["Label NL","Ander type revisie, specificeer"]
["Definitie","Andere benadering, specificeer"]
["Doel / reden uitvraag","Inzicht in kwaliteit; Leren en verbeteren; inzicht in benadering die niet tot de keuzemogelijkheden behoren "]
["Waarde verplicht","Functioneel verplicht wanneer er ‘Andere benadering’ geregistreerd is"]
["Datatype","Tekst (TXT) "]
["Domein (acceptabele range, min-max)"]
["Eenheid"]
["Format (max. lengte)",40]
["Decimalen"]
["Codering (EN/NL)"]
["Periode","Sinds start registratie"]
["Wijziging (datum en reden)"]
["Noodzakelijk voor kwaliteitsindicatoren","Nee"]
["Opmerkingen","Specificeerveld in tekst"]
["Zorg Informatie Bouwsteen (ZIB)","ZIB: \nContainer (1): \nContainer (2): \nDataelement: \nOmzetting naar LROI:"]
["Voorbeeld","<approachOther>abcdedfgh</approachOther>"]
[]
["Terug naar Overzicht"]

{"sheet":"Correctie osteotomie uitgev","index":126,"n_rows":23,"n_cols":2,"rows_kept":23,"cut":false,"hidden":false,"merged":[]}
["DATA_ID",{"$f":"INDEX(Overzicht_unique!$A:$AJ, MATCH($B$2,Overzicht_unique!$A:$A,0), 36)","v":"LROI048"}]
["LROI uitvraag","(Correctie) osteotomie uitgevoerd"]
["Variabelenaam XML","osteotomyPerformed"]
["Variabelenaam database","osteotomy_performed"]
["Label EN","(Corrective) osteotomy performed"]
["Label NL","(Correctie) osteotomie uitgevoerd"]
["Definitie","Operatie waarbij het heupbot doorgezaagd of doorgenomen wordt met als doel scheefstand van een bot te corrigeren of de belasting op het heupgewricht "]
["Doel / reden uitvraag","Inzicht in kwaliteit en nevenverrichtingen"]
["Waarde verplicht","Functioneel verplicht "]
["Datatype","Integer (INT)"]
["Domein (acceptabele range, min-max)"]
["Eenheid"]
["Format (max. lengte)"]
["Decimalen"]
["Codering (EN/NL)","0=No/ Nee\n1=Yes/ Ja"]
["Periode","Sinds LROI-ingrepen v5.1; 01-01-2022"]
["Wijziging (datum en reden)","Relevante extra procedure die kan voorkomen. "]
["Noodzakelijk voor kwaliteitsindicatoren","Nee"]
["Opmerkingen"]
["Zorg Informatie Bouwsteen (ZIB)","ZIB: Verrichting\nContainer (1): \nContainer (2): \nDataelement: VerrichtingType; VerrichtingStartDatum\nOmzetting naar LROI:"]
["Voorbeeld","<osteotomyPerformed>1</osteotomyPerformed>"]
[]
["Terug naar Overzicht"]

{"sheet":"Osteosynthese uitgevoerd","index":127,"n_rows":23,"n_cols":2,"rows_kept":23,"cut":false,"hidden":false,"merged":[]}
["DATA_ID",{"$f":"INDEX(Overzicht_unique!$A:$AJ, MATCH($B$2,Overzicht_unique!$A:$A,0), 36)","v":"LROI049"}]
["LROI uitvraag","Osteosynthese uitgevoerd"]
["Variabelenaam XML","osteosynthesisPerformed"]
["Variabelenaam database","osteosynthesis_performed"]
["Label EN","Osteosynthesis performed"]
["Label NL","Osteosynthese uitgevoerd"]
["Definitie","Repositie en fixatie van fracturen of pseudoartrose met behulp van (een combinatie van) metalen platen, pennen en/of schroeven."]
["Doel / reden uitvraag","Inzicht in kwaliteit en nevenverrichtingen"]
["Waarde verplicht","Functioneel verplicht "]
["Datatype","Integer (INT)"]
["Domein (acceptabele range, min-max)"]
["Eenheid"]
["Format (max. lengte)"]
["Decimalen"]
["Codering (EN/NL)","0=No/ Nee\n1=Yes/ Ja"]
["Periode","Sinds LROI-ingrepen v5.1; 01-01-2022"]
["Wijziging (datum en reden)","Relevante extra procedure die kan voorkomen. "]
["Noodzakelijk voor kwaliteitsindicatoren","Nee"]
["Opmerkingen"]
["Zorg Informatie Bouwsteen (ZIB)","ZIB: Verrichting\nContainer (1): \nContainer (2): \nDataelement: VerrichtingType; VerrichtingStartDatum\nOmzetting naar LROI:"]
["Voorbeeld","<osteosynthesisPerformed>1</osteosynthesisPerformed>"]
[]
["Terug naar Overzicht"]

{"sheet":"Tuberositas osteotomie uitgev","index":128,"n_rows":23,"n_cols":2,"rows_kept":23,"cut":false,"hidden":false,"merged":[]}
["DATA_ID",{"$f":"INDEX(Overzicht_unique!$A:$AJ, MATCH($B$2,Overzicht_unique!$A:$A,0), 36)","v":"LROI147"}]
["LROI uitvraag","Tuberositas osteotomie uitgevoerd"]
["Variabelenaam XML","tuberositasOsteotomy"]
["Variabelenaam database","tuberositas_osteo"]
["Label EN","Tuberositas osteotomy performed"]
["Label NL","Tuberositas osteotomie uitgevoerd"]
["Definitie","Operatie waarbij de tuberositas wordt losgemaakt"]
["Doel / reden uitvraag","Inzicht in kwaliteit en nevenverrichtingen"]
["Waarde verplicht","Functioneel verplicht "]
["Datatype","Integer (INT)"]
["Domein (acceptabele range, min-max)"]
["Eenheid"]
["Format (max. lengte)"]
["Decimalen"]
["Codering (EN/NL)","0=No/ Nee\n1=Yes/ Ja"]
["Periode","Sinds start registratie"]
["Wijziging (datum en reden)","Relevante extra procedure die kan voorkomen. "]
["Noodzakelijk voor kwaliteitsindicatoren","Nee"]
["Opmerkingen"]
["Zorg Informatie Bouwsteen (ZIB)","ZIB: Verrichting\nContainer (1): \nContainer (2): \nDataelement: VerrichtingType; VerrichtingStartDatum\nOmzetting naar LROI:"]
["Voorbeeld","<tuberositasOsteotomy>1</tuberositasOsteotomy>"]
[]
["Terug naar Overzicht"]

{"sheet":"Mm osteotomie uitgev","index":129,"n_rows":23,"n_cols":2,"rows_kept":23,"cut":false,"hidden":false,"merged":[]}
["DATA_ID",{"$f":"INDEX(Overzicht_unique!$A:$AJ, MATCH($B$2,Overzicht_unique!$A:$A,0), 36)","v":"LROI236"}]
["LROI uitvraag","Mediale malleolus osteotomie uitgevoerd"]
["Variabelenaam XML","medialMalleolarOsteotomy"]
["Variabelenaam database","med_malleolus_osteo"]
["Label EN","Medial malleolar osteotomy performed"]
["Label NL","Mediale malleolus osteotomie uitgevoerd"]
["Definitie","Osteotomie (van de mediale malleolus) in het kader van het stabiliseren van de enkel"]
["Doel / reden uitvraag","Inzicht in kwaliteit en nevenverrichtingen"]
["Waarde verplicht","Functioneel verplicht "]
["Datatype","Integer (INT)"]
["Domein (acceptabele range, min-max)"]
["Eenheid"]
["Format (max. lengte)"]
["Decimalen"]
["Codering (EN/NL)","0=No/ Nee\n1=Yes/ Ja"]
["Periode","Sinds start registratie"]
["Wijziging (datum en reden)","Relevante extra procedure die kan voorkomen. "]
["Noodzakelijk voor kwaliteitsindicatoren","Nee"]
["Opmerkingen"]
["Zorg Informatie Bouwsteen (ZIB)","ZIB: Verrichting\nContainer (1): \nContainer (2): \nDataelement: VerrichtingType; VerrichtingStartDatum\nOmzetting naar LROI:"]
["Voorbeeld","<medialMalleolarOsteotomy>1</medialMalleolarOsteotomy>"]
[]
["Terug naar Overzicht"]

{"sheet":"Achillespeesverlenging uitgev","index":130,"n_rows":23,"n_cols":2,"rows_kept":23,"cut":false,"hidden":false,"merged":[]}
["DATA_ID",{"$f":"INDEX(Overzicht_unique!$A:$AJ, MATCH($B$2,Overzicht_unique!$A:$A,0), 36)","v":"LROI237"}]
["LROI uitvraag","Achillespeesverlenging uitgevoerd"]
["Variabelenaam XML","achillesTendonLengthening"]
["Variabelenaam database","achillestendon_lengthening"]
["Label EN","Achilles tendon lengthening performed"]
["Label NL","Achillespeesverlenging uitgevoerd"]
["Definitie","Procedure ter verlenging van de kuitspier om een spitsstand te corrigeren of om dorsiflexie van de enkel (beweeglijkheid van de prothese) te verbeteren"]
["Doel / reden uitvraag","Inzicht in kwaliteit en nevenverrichtingen"]
["Waarde verplicht","Functioneel verplicht "]
["Datatype","Integer (INT)"]
["Domein (acceptabele range, min-max)"]
["Eenheid"]
["Format (max. lengte)"]
["Decimalen"]
["Codering (EN/NL)","0=No/ Nee\n1=Yes/ Ja"]
["Periode","Sinds start registratie"]
["Wijziging (datum en reden)","Relevante extra procedure die kan voorkomen. "]
["Noodzakelijk voor kwaliteitsindicatoren","Nee"]
["Opmerkingen"]
["Zorg Informatie Bouwsteen (ZIB)","ZIB: Verrichting\nContainer (1): \nContainer (2): \nDataelement: VerrichtingType; VerrichtingStartDatum\nOmzetting naar LROI:"]
["Voorbeeld","<achillesTendonLengthening>1</achillesTendonLengthening>"]
[]
["Terug naar Overzicht"]

{"sheet":"Ligament reconstructie uitgev","index":131,"n_rows":23,"n_cols":2,"rows_kept":23,"cut":false,"hidden":false,"merged":[]}
["DATA_ID",{"$f":"INDEX(Overzicht_unique!$A:$AJ, MATCH($B$2,Overzicht_unique!$A:$A,0), 36)","v":"LROI238, LROI598"}]
["LROI uitvraag","Ligament reconstructie uitgevoerd"]
["Variabelenaam XML","ligamentReconstruction"]
["Variabelenaam database","ligament_reconstr"]
["Label EN","Ligament reconstruction performed"]
["Label NL","Ligament reconstructie uitgevoerd"]
["Definitie","Het reven van laterale en/of mediale banden van de enkel om laterale en/of mediale instabiliteit van de enkel op te heffen. Men kan gebruikmaken van de aanwezige weke delen en streven naar een anatomische stabilisatie/reconstructie OF wanneer dit technisch gezien niet volstaat gebruikmaken van peesweefsel (autograft of allograft) of andere materialen.\nReconstructie van het vingerelement."]
["Doel / reden uitvraag","Inzicht in kwaliteit en nevenverrichtingen"]
["Waarde verplicht","Functioneel verplicht "]
["Datatype","Integer (INT)"]
["Domein (acceptabele range, min-max)"]
["Eenheid"]
["Format (max. lengte)"]
["Decimalen"]
["Codering (EN/NL)","Enkel:\n0=No/Nee\n1=Yes, anatomic/Ja, anatomisch\n2=Yes, non-anatomic/Ja, niet-anatomisch\nVinger: \n0=No/ Nee\n1=Yes/ Ja"]
["Periode","Sinds start registratie"]
["Wijziging (datum en reden)","Relevante extra procedure die kan voorkomen. "]
["Noodzakelijk voor kwaliteitsindicatoren","Nee"]
["Opmerkingen"]
["Zorg Informatie Bouwsteen (ZIB)","ZIB: Verrichting\nContainer (1): \nContainer (2): \nDataelement: VerrichtingType; VerrichtingStartDatum\nOmzetting naar LROI:"]
["Voorbeeld","<ligamentReconstruction>1</ligamentReconstruction>"]
[]
["Terug naar Overzicht"]

{"sheet":"Osteotomie van het tm uitgev","index":132,"n_rows":23,"n_cols":2,"rows_kept":23,"cut":false,"hidden":false,"merged":[]}
["DATA_ID",{"$f":"INDEX(Overzicht_unique!$A:$AJ, MATCH($B$2,Overzicht_unique!$A:$A,0), 36)","v":"LROI320"}]
["LROI uitvraag","Osteotomie van het tuberculum minus uitgevoerd"]
["Variabelenaam XML","tuberositasOsteotomy"]
["Variabelenaam database","osteotomy"]
["Label EN","Osteotomy lesser tuberosity performed"]
["Label NL","Osteotomie van het tuberculum minus uitgevoerd"]
["Definitie","Losmaken van het tuberculum minus samen met de aanhechting van de subscapularispees"]
["Doel / reden uitvraag","Inzicht in kwaliteit en nevenverrichtingen"]
["Waarde verplicht","Functioneel verplicht "]
["Datatype","Integer (INT)"]
["Domein (acceptabele range, min-max)"]
["Eenheid"]
["Format (max. lengte)"]
["Decimalen"]
["Codering (EN/NL)","0=No/ Nee\n1=Yes/ Ja"]
["Periode","Sinds start registratie"]
["Wijziging (datum en reden)","Relevante extra procedure die kan voorkomen. "]
["Noodzakelijk voor kwaliteitsindicatoren","Nee"]
["Opmerkingen"]
["Zorg Informatie Bouwsteen (ZIB)","ZIB: Verrichting\nContainer (1): \nContainer (2): \nDataelement: VerrichtingType; VerrichtingStartDatum\nOmzetting naar LROI:"]
["Voorbeeld","<tuberositasOsteotomy>1</tuberositasOsteotomy>"]
[]
["Terug naar Overzicht"]

{"sheet":"Acromioplastiek uitgevoerd","index":133,"n_rows":23,"n_cols":2,"rows_kept":23,"cut":false,"hidden":false,"merged":[]}
["DATA_ID",{"$f":"INDEX(Overzicht_unique!$A:$AJ, MATCH($B$2,Overzicht_unique!$A:$A,0), 36)","v":"LROI321"}]
["LROI uitvraag","Acromioplastiek uitgevoerd"]
["Variabelenaam XML","acromioplasty"]
["Variabelenaam database","acromioplasty"]
["Label EN","Acromioplasty performed"]
["Label NL","Acromioplastiek uitgevoerd"]
["Definitie","Operatieve verwijdering van bursaweefsel en vergroting van de subacromiale ruimte door het verwijderen van een benig impingement van het acromion."]
["Doel / reden uitvraag","Inzicht in kwaliteit en nevenverrichtingen"]
["Waarde verplicht","Functioneel verplicht "]
["Datatype","Integer (INT)"]
["Domein (acceptabele range, min-max)"]
["Eenheid"]
["Format (max. lengte)"]
["Decimalen"]
["Codering (EN/NL)","0=No/ Nee\n1=Yes/ Ja"]
["Periode","Sinds start registratie"]
["Wijziging (datum en reden)","Relevante extra procedure die kan voorkomen. "]
["Noodzakelijk voor kwaliteitsindicatoren","Nee"]
["Opmerkingen"]
["Zorg Informatie Bouwsteen (ZIB)","ZIB: Verrichting\nContainer (1): \nContainer (2): \nDataelement: VerrichtingType; VerrichtingStartDatum\nOmzetting naar LROI:"]
["Voorbeeld","<acromioplasty>1</acromioplasty>"]
[]
["Terug naar Overzicht"]

{"sheet":"Cuff reconstructie uitgevoerd","index":134,"n_rows":23,"n_cols":2,"rows_kept":23,"cut":false,"hidden":false,"merged":[]}
["DATA_ID",{"$f":"INDEX(Overzicht_unique!$A:$AJ, MATCH($B$2,Overzicht_unique!$A:$A,0), 36)","v":"LROI322"}]
["LROI uitvraag","Cuff reconstructie uitgevoerd"]
["Variabelenaam XML","cuffReconstruction"]
["Variabelenaam database","cuff_reconstr"]
["Label EN","Cuff reconstruction performed"]
["Label NL","Cuff reconstructie uitgevoerd"]
["Definitie","(Een gedeelte van) de cuff is teruggehecht op de humeruskop"]
["Doel / reden uitvraag","Inzicht in kwaliteit en nevenverrichtingen"]
["Waarde verplicht","Functioneel verplicht "]
["Datatype","Integer (INT)"]
["Domein (acceptabele range, min-max)"]
["Eenheid"]
["Format (max. lengte)"]
["Decimalen"]
["Codering (EN/NL)","0=No/ Nee\n1=Yes/ Ja"]
["Periode","Sinds start registratie"]
["Wijziging (datum en reden)","Relevante extra procedure die kan voorkomen. "]
["Noodzakelijk voor kwaliteitsindicatoren","Nee"]
["Opmerkingen"]
["Zorg Informatie Bouwsteen (ZIB)","ZIB: Verrichting\nContainer (1): \nContainer (2): \nDataelement: VerrichtingType; VerrichtingStartDatum\nOmzetting naar LROI:"]
["Voorbeeld","<cuffReconstruction>1</cuffReconstruction>"]
[]
["Terug naar Overzicht"]

{"sheet":"Distale clavicula resect uitgev","index":135,"n_rows":23,"n_cols":2,"rows_kept":23,"cut":false,"hidden":false,"merged":[]}
["DATA_ID",{"$f":"INDEX(Overzicht_unique!$A:$AJ, MATCH($B$2,Overzicht_unique!$A:$A,0), 36)","v":"LROI323"}]
["LROI uitvraag","Distale clavicula resectie uitgevoerd"]
["Variabelenaam XML","distalClavicleResection"]
["Variabelenaam database","Verwijderen van het distale uiteinde van de clavicula"]
["Label EN","Distal clavicle resection performed"]
["Label NL","Distale clavicula resectie uitgevoerd"]
["Definitie","Verwijderen van het distale uiteinde van de clavicula"]
["Doel / reden uitvraag","Inzicht in kwaliteit en nevenverrichtingen"]
["Waarde verplicht","Functioneel verplicht "]
["Datatype","Integer (INT)"]
["Domein (acceptabele range, min-max)"]
["Eenheid"]
["Format (max. lengte)"]
["Decimalen"]
["Codering (EN/NL)","0=No/ Nee\n1=Yes/ Ja"]
["Periode","Sinds start registratie"]
["Wijziging (datum en reden)","Relevante extra procedure die kan voorkomen. "]
["Noodzakelijk voor kwaliteitsindicatoren","Nee"]
["Opmerkingen"]
["Zorg Informatie Bouwsteen (ZIB)","ZIB: Verrichting\nContainer (1): \nContainer (2): \nDataelement: VerrichtingType; VerrichtingStartDatum\nOmzetting naar LROI:"]
["Voorbeeld","<distalClavicleResection>1</distalClavicleResection>"]
[]
["Terug naar Overzicht"]

{"sheet":"LCL losgemaakt","index":136,"n_rows":23,"n_cols":2,"rows_kept":23,"cut":false,"hidden":false,"merged":[]}
["DATA_ID",{"$f":"INDEX(Overzicht_unique!$A:$AJ, MATCH($B$2,Overzicht_unique!$A:$A,0), 36)","v":"LROI408"}]
["LROI uitvraag","LCL losgemaakt"]
["Variabelenaam XML","lclReleased"]
["Variabelenaam database","lcl_released"]
["Label EN","LCL released"]
["Label NL","LCL losgemaakt"]
["Definitie","Losmaken van laterale collaterale ligament (LCL)"]
["Doel / reden uitvraag","Inzicht in kwaliteit en nevenverrichtingen"]
["Waarde verplicht","Functioneel verplicht "]
["Datatype","Integer (INT)"]
["Domein (acceptabele range, min-max)"]
["Eenheid"]
["Format (max. lengte)"]
["Decimalen"]
["Codering (EN/NL)","0=No/ Nee\n1=Yes/ Ja"]
["Periode","Sinds start registratie"]
["Wijziging (datum en reden)","Uitvraag gewijzigd in LROI-ingrepen v5.1; 01-01-2022. \"LCL losgemaakt\" voorheen onderdeel van \"Benadering\". Wordt sinds 2022 uitgevraagd als aparte variabele."]
["Noodzakelijk voor kwaliteitsindicatoren","Nee"]
["Opmerkingen"]
["Zorg Informatie Bouwsteen (ZIB)","ZIB: Verrichting\nContainer (1): \nContainer (2): \nDataelement: VerrichtingType; VerrichtingStartDatum\nOmzetting naar LROI:"]
["Voorbeeld","<lclReleased>1</lclReleased>"]
[]
["Terug naar Overzicht"]

{"sheet":"Decompressie ulnaire zenuw","index":137,"n_rows":23,"n_cols":2,"rows_kept":23,"cut":false,"hidden":false,"merged":[]}
["DATA_ID",{"$f":"INDEX(Overzicht_unique!$A:$AJ, MATCH($B$2,Overzicht_unique!$A:$A,0), 36)","v":"LROI409"}]
["LROI uitvraag","Decompressie ulnaire zenuw"]
["Variabelenaam XML","ulnarNerveRelease"]
["Variabelenaam database","ulnar_nerve_release"]
["Label EN","Ulnar nerve release"]
["Label NL","Decompressie ulnaire zenuw"]
["Definitie","Vrijleggen van de ulnaire zenuw"]
["Doel / reden uitvraag","Inzicht in kwaliteit en nevenverrichtingen"]
["Waarde verplicht","Functioneel verplicht "]
["Datatype","Integer (INT)"]
["Domein (acceptabele range, min-max)"]
["Eenheid"]
["Format (max. lengte)"]
["Decimalen"]
["Codering (EN/NL)","0=No/ Nee\n1=Yes/ Ja"]
["Periode","Sinds start registratie"]
["Wijziging (datum en reden)"]
["Noodzakelijk voor kwaliteitsindicatoren","Nee"]
["Opmerkingen"]
["Zorg Informatie Bouwsteen (ZIB)","ZIB: Verrichting\nContainer (1): \nContainer (2): \nDataelement: VerrichtingType; VerrichtingStartDatum\nOmzetting naar LROI:"]
["Voorbeeld","<ulnarNerveRelease>1</ulnarNerveRelease>"]
[]
["Terug naar Overzicht"]

{"sheet":"Transpositie ulnaire zenuw","index":138,"n_rows":23,"n_cols":2,"rows_kept":23,"cut":false,"hidden":false,"merged":[]}
["DATA_ID",{"$f":"INDEX(Overzicht_unique!$A:$AJ, MATCH($B$2,Overzicht_unique!$A:$A,0), 36)","v":"LROI410"}]
["LROI uitvraag","Transpositie ulnaire zenuw"]
["Variabelenaam XML","ulnarNerveTransposition"]
["Variabelenaam database","ulnar_nerve_transpos"]
["Label EN","Ulnar nerve transposition"]
["Label NL","Transpositie ulnaire zenuw"]
["Definitie","Omleggen van de ulnaire zenuw"]
["Doel / reden uitvraag","Inzicht in kwaliteit en nevenverrichtingen"]
["Waarde verplicht","Functioneel verplicht "]
["Datatype","Integer (INT)"]
["Domein (acceptabele range, min-max)"]
["Eenheid"]
["Format (max. lengte)"]
["Decimalen"]
["Codering (EN/NL)","0=No/ Nee\n1=Yes/ Ja"]
["Periode","Sinds start registratie"]
["Wijziging (datum en reden)"]
["Noodzakelijk voor kwaliteitsindicatoren","Nee"]
["Opmerkingen"]
["Zorg Informatie Bouwsteen (ZIB)","ZIB: Verrichting\nContainer (1): \nContainer (2): \nDataelement: VerrichtingType; VerrichtingStartDatum\nOmzetting naar LROI:"]
["Voorbeeld","<ulnarNerveTransposition>1</ulnarNerveTransposition>"]
[]
["Terug naar Overzicht"]

{"sheet":"Weke delen stabilisatie","index":139,"n_rows":23,"n_cols":2,"rows_kept":23,"cut":false,"hidden":false,"merged":[]}
["DATA_ID",{"$f":"INDEX(Overzicht_unique!$A:$AJ, MATCH($B$2,Overzicht_unique!$A:$A,0), 36)","v":"LROI502, LROI593"}]
["LROI uitvraag","Weke delen stabilisatie"]
["Variabelenaam XML","softTissuesStabilisation"]
["Variabelenaam database","soft_tissue_stabil"]
["Label EN","Soft tissue stabilisation"]
["Label NL","Weke delen stabilisatie"]
["Definitie","definitie nog niet aanwezig op formulieren"]
["Doel / reden uitvraag","Inzicht in kwaliteit en nevenverrichtingen"]
["Waarde verplicht","Functioneel verplicht "]
["Datatype","Integer (INT)"]
["Domein (acceptabele range, min-max)"]
["Eenheid"]
["Format (max. lengte)"]
["Decimalen"]
["Codering (EN/NL)","Pols: \n1=capsule/ligament reconstruction/Capsule/ligamentreconstructie\n2=tendon reconstruction or transposition/Peesreconstructie/peesomlegging\n99=Other stabilisation, specify/Andere stabilisatie, specificeer\nVinger:\n1=Collateral ligaments/Collaterale ligamenten\n2=Transposition intrinsic musculature/Transpositie intrinsieke musculatuur\n3=Joint capsule arthroplasty/Kapselplastiek\n4=Reinsertion own tendon/Reinsertie/Reving eigen pees\n5=Volar plate/Volaire plaat\n99=Other stabilisation, specify/Andere stabilisatie, specificeer"]
["Periode","Sinds start registratie"]
["Wijziging (datum en reden)","Antwoordopties uitgebreid in LROI-ingrepen v5.1; 01-01-2022. \"Intrinsieke transpositie\" gewijzigd naar \"Transpositie intrinsieke musculatuur\". \"Kapselplastiek\" en \"Reinsertie/ Reving eigen spees\" zijn toegevoegd. "]
["Noodzakelijk voor kwaliteitsindicatoren","Nee"]
["Opmerkingen"]
["Zorg Informatie Bouwsteen (ZIB)","ZIB: Verrichting\nContainer (1): \nContainer (2): \nDataelement: VerrichtingType; VerrichtingStartDatum\nOmzetting naar LROI:"]
["Voorbeeld","<softTissuesStabilisation>1</softTissuesStabilisation>"]
[]
["Terug naar Overzicht"]

{"sheet":"Andere weke delen stabili, spec","index":140,"n_rows":23,"n_cols":2,"rows_kept":23,"cut":false,"hidden":false,"merged":[]}
["DATA_ID",{"$f":"INDEX(Overzicht_unique!$A:$AJ, MATCH($B$2,Overzicht_unique!$A:$A,0), 36)","v":"LROI503, LROI594"}]
["LROI uitvraag","Andere weke delen stabilisatie, specificeer"]
["Variabelenaam XML","softTissuesStabilisationOther"]
["Variabelenaam database","soft_tissue_stabil_other"]
["Label EN","Other soft tissue stabilisation, specify"]
["Label NL","Andere weke delen stabilisatie, specificeer"]
["Definitie"]
["Doel / reden uitvraag","Inzicht in kwaliteit; inzicht in weke delen stabilisatie die niet tot de keuzemogelijkheden behoren "]
["Waarde verplicht","Functioneel verplicht wanneer er ‘Andere weke delen stabilisatie’ geregistreerd is"]
["Datatype","Tekst (TXT)"]
["Domein (acceptabele range, min-max)"]
["Eenheid"]
["Format (max. lengte)",40]
["Decimalen"]
["Codering (EN/NL)"]
["Periode","Sinds start registratie"]
["Wijziging (datum en reden)"]
["Noodzakelijk voor kwaliteitsindicatoren","Nee"]
["Opmerkingen","Specificeerveld in tekst"]
["Zorg Informatie Bouwsteen (ZIB)","ZIB: Verrichting\nContainer (1): \nContainer (2): \nDataelement: VerrichtingType; VerrichtingStartDatum\nOmzetting naar LROI:"]
["Voorbeeld","<softTissuesStabilisationOther>abcdefg</softTissuesStabilisationOther>"]
[]
["Terug naar Overzicht"]

{"sheet":"Darrach procedure uitgevoerd","index":141,"n_rows":23,"n_cols":2,"rows_kept":23,"cut":false,"hidden":false,"merged":[]}
["DATA_ID",{"$f":"INDEX(Overzicht_unique!$A:$AJ, MATCH($B$2,Overzicht_unique!$A:$A,0), 36)","v":"LROI504"}]
["LROI uitvraag","Darrach procedure uitgevoerd"]
["Variabelenaam XML","darrachProcedure"]
["Variabelenaam database","boneproc_darrach"]
["Label EN","Darrach procedure performed"]
["Label NL","Darrach procedure uitgevoerd"]
["Definitie","Bij de ulna kop resectie of Darrach procedure wordt het polsgedeelte van de ellepijp verwijderd zodat er geen wrijving meer is tussen het spaakbeen en de ellepijp, de pijn zal hierdoor afnemen"]
["Doel / reden uitvraag","Inzicht in kwaliteit en nevenverrichtingen"]
["Waarde verplicht","Functioneel verplicht "]
["Datatype","Integer (INT)"]
["Domein (acceptabele range, min-max)"]
["Eenheid"]
["Format (max. lengte)"]
["Decimalen"]
["Codering (EN/NL)","0=No/ Nee\n1=Yes/ Ja"]
["Periode","Sinds start registratie"]
["Wijziging (datum en reden)"]
["Noodzakelijk voor kwaliteitsindicatoren","Nee"]
["Opmerkingen"]
["Zorg Informatie Bouwsteen (ZIB)","ZIB: Verrichting\nContainer (1): \nContainer (2): \nDataelement: VerrichtingType; VerrichtingStartDatum\nOmzetting naar LROI:"]
["Voorbeeld","<darrachProcedure>1</darrachProcedure>"]
[]
["Terug naar Overzicht"]

{"sheet":"Ulna osteotomie uitgevoerd","index":142,"n_rows":23,"n_cols":2,"rows_kept":23,"cut":false,"hidden":false,"merged":[]}
["DATA_ID",{"$f":"INDEX(Overzicht_unique!$A:$AJ, MATCH($B$2,Overzicht_unique!$A:$A,0), 36)","v":"LROI505"}]
["LROI uitvraag","Ulna osteotomie uitgevoerd"]
["Variabelenaam XML","ulnaOsteotomy"]
["Variabelenaam database","boneproc_ulna_osteo"]
["Label EN","Ulna osteotomy performed"]
["Label NL","Ulna osteotomie uitgevoerd"]
["Definitie","Inkorten van de ulna (ellepijp). Een lange ulna kan pijnklachten veroorzaken in de pols aan de kant van de pink. Als niet-operatieve behandeling geen effect heeft, is een operatie mogelijk, waarbij de ulna wordt ingekort. "]
["Doel / reden uitvraag","Inzicht in kwaliteit en nevenverrichtingen"]
["Waarde verplicht","Functioneel verplicht "]
["Datatype","Integer (INT)"]
["Domein (acceptabele range, min-max)"]
["Eenheid"]
["Format (max. lengte)"]
["Decimalen"]
["Codering (EN/NL)","0=No/ Nee\n1=Yes/ Ja"]
["Periode","Sinds start registratie"]
["Wijziging (datum en reden)"]
["Noodzakelijk voor kwaliteitsindicatoren","Nee"]
["Opmerkingen"]
["Zorg Informatie Bouwsteen (ZIB)","ZIB: Verrichting\nContainer (1): \nContainer (2): \nDataelement: VerrichtingType; VerrichtingStartDatum\nOmzetting naar LROI:"]
["Voorbeeld","<ulnaOsteotomy>1</ulnaOsteotomy>"]
[]
["Terug naar Overzicht"]

{"sheet":"Proximale rij resectie uitgev","index":143,"n_rows":23,"n_cols":2,"rows_kept":23,"cut":false,"hidden":false,"merged":[]}
["DATA_ID",{"$f":"INDEX(Overzicht_unique!$A:$AJ, MATCH($B$2,Overzicht_unique!$A:$A,0), 36)","v":"LROI506"}]
["LROI uitvraag","Proximale rij resectie uitgevoerd"]
["Variabelenaam XML","proximalRowResection"]
["Variabelenaam database","boneproc_prox"]
["Label EN","Proximal row resection performed"]
["Label NL","Proximale rij resectie uitgevoerd"]
["Definitie","Het operatief verwijderen van de eerste rij handwortelbeentjes."]
["Doel / reden uitvraag","Inzicht in kwaliteit en nevenverrichtingen"]
["Waarde verplicht","Functioneel verplicht "]
["Datatype","Integer (INT)"]
["Domein (acceptabele range, min-max)"]
["Eenheid"]
["Format (max. lengte)"]
["Decimalen"]
["Codering (EN/NL)","0=No/ Nee\n1=Yes/ Ja"]
["Periode","Sinds start registratie"]
["Wijziging (datum en reden)"]
["Noodzakelijk voor kwaliteitsindicatoren","Nee"]
["Opmerkingen"]
["Zorg Informatie Bouwsteen (ZIB)","ZIB: Verrichting\nContainer (1): \nContainer (2): \nDataelement: VerrichtingType; VerrichtingStartDatum\nOmzetting naar LROI:"]
["Voorbeeld","<proximalRowResection>1</proximalRowResection>"]
[]
["Terug naar Overzicht"]

{"sheet":"Andere botprocedure, spec","index":144,"n_rows":23,"n_cols":2,"rows_kept":23,"cut":false,"hidden":false,"merged":[]}
["DATA_ID",{"$f":"INDEX(Overzicht_unique!$A:$AJ, MATCH($B$2,Overzicht_unique!$A:$A,0), 36)","v":"LROI507"}]
["LROI uitvraag","Andere botprocedure, specificeer"]
["Variabelenaam XML","additionalBoneProceduresOther"]
["Variabelenaam database","boneproc_other; additional_boneproc_other"]
["Label EN","Other bone procedure, specify"]
["Label NL","Andere botprocedure, specificeer"]
["Definitie","Andere botprocedure dan aangegeven op het formulier"]
["Doel / reden uitvraag","Inzicht in kwaliteit; inzicht in botprocedure die niet tot de keuzemogelijkheden behoren "]
["Waarde verplicht","Functioneel verplicht"]
["Datatype","Tekst (TXT)"]
["Domein (acceptabele range, min-max)"]
["Eenheid"]
["Format (max. lengte)",40]
["Decimalen"]
["Codering (EN/NL)"]
["Periode","Sinds start registratie"]
["Wijziging (datum en reden)"]
["Noodzakelijk voor kwaliteitsindicatoren","Nee"]
["Opmerkingen","Specificeerveld in tekst"]
["Zorg Informatie Bouwsteen (ZIB)","ZIB: Verrichting\nContainer (1): \nContainer (2): \nDataelement: VerrichtingType; VerrichtingStartDatum\nOmzetting naar LROI:"]
["Voorbeeld","<additionalBoneProceduresOther>abcdefg</additionalBoneProceduresOther>"]
[]
["Terug naar Overzicht"]

{"sheet":"PSI gebruikt","index":145,"n_rows":23,"n_cols":2,"rows_kept":23,"cut":false,"hidden":false,"merged":[]}
["DATA_ID",{"$f":"INDEX(Overzicht_unique!$A:$AJ, MATCH($B$2,Overzicht_unique!$A:$A,0), 36)","v":"LROI050, LROI151, LROI240, LROI324, LROI411"}]
["LROI uitvraag","Patient Specific Instrumentation (PSI) gebruikt"]
["Variabelenaam XML","psi"]
["Variabelenaam database","psi"]
["Label EN","Patient Specific Instrumentation (PSI) applied"]
["Label NL","Patient Specific Instrumentation (PSI) gebruikt"]
["Definitie","Er worden op maat gemaakte zaagmalletjes gebruikt"]
["Doel / reden uitvraag","Inzicht in kwaliteit"]
["Waarde verplicht","Functioneel verplicht "]
["Datatype","Integer (INT)"]
["Domein (acceptabele range, min-max)"]
["Eenheid"]
["Format (max. lengte)"]
["Decimalen"]
["Codering (EN/NL)","0=No/ Nee\n1=Yes/ Ja"]
["Periode","Heup, knie, enkel, elleboog sinds LROI-ingrepen v5.1; 01-01-2022; Schouder sinds start registratie"]
["Wijziging (datum en reden)"]
["Noodzakelijk voor kwaliteitsindicatoren","Nee"]
["Opmerkingen"]
["Zorg Informatie Bouwsteen (ZIB)","ZIB: Verrichting\nContainer (1): \nContainer (2): \nDataelement: VerrichtingType\nOmzetting naar LROI:"]
["Voorbeeld","<psi>1</psi>"]
[]
["Terug naar Overzicht"]

{"sheet":"Navigatie gebruikt","index":146,"n_rows":23,"n_cols":2,"rows_kept":23,"cut":false,"hidden":false,"merged":[]}
["DATA_ID",{"$f":"INDEX(Overzicht_unique!$A:$AJ, MATCH($B$2,Overzicht_unique!$A:$A,0), 36)","v":"LROI051, LROI152, LROI241, LROI325, LROI412"}]
["LROI uitvraag","Navigatie gebruikt"]
["Variabelenaam XML","navigation"]
["Variabelenaam database","navigation"]
["Label EN","Navigation applied"]
["Label NL","Navigatie gebruikt"]
["Definitie","Implantaten worden geplaatst onder geleide van beeldvormende techniek, zoals CT- of MRI scans"]
["Doel / reden uitvraag","Inzicht in kwaliteit"]
["Waarde verplicht","Functioneel verplicht "]
["Datatype","Integer (INT)"]
["Domein (acceptabele range, min-max)"]
["Eenheid"]
["Format (max. lengte)"]
["Decimalen"]
["Codering (EN/NL)","0=No/ Nee\n1=Yes/ Ja"]
["Periode","LROI-ingrepen v5.1; 01-01-2022"]
["Wijziging (datum en reden)"]
["Noodzakelijk voor kwaliteitsindicatoren","Nee"]
["Opmerkingen"]
["Zorg Informatie Bouwsteen (ZIB)","ZIB: Verrichting\nContainer (1): \nContainer (2): \nDataelement: VerrichtingType\nOmzetting naar LROI:"]
["Voorbeeld","<navigation>1</navigation>"]
[]
["Terug naar Overzicht"]

{"sheet":"Doorlichting gebruikt","index":147,"n_rows":23,"n_cols":2,"rows_kept":23,"cut":false,"hidden":false,"merged":[]}
["DATA_ID",{"$f":"INDEX(Overzicht_unique!$A:$AJ, MATCH($B$2,Overzicht_unique!$A:$A,0), 36)","v":"LROI052"}]
["LROI uitvraag","Doorlichting gebruikt"]
["Variabelenaam XML","screening"]
["Variabelenaam database","screening"]
["Label EN","Screening applied"]
["Label NL","Navigatie gebruikt"]
["Definitie","Tijdens de operatie wordt conventionele röntgendoorlichting gebruikt om de positie van het implantaat te controleren"]
["Doel / reden uitvraag","Inzicht in kwaliteit"]
["Waarde verplicht","Functioneel verplicht "]
["Datatype","Integer (INT)"]
["Domein (acceptabele range, min-max)"]
["Eenheid"]
["Format (max. lengte)"]
["Decimalen"]
["Codering (EN/NL)","0=No/ Nee\n1=Yes/ Ja"]
["Periode","LROI-ingrepen v5.1; 01-01-2022"]
["Wijziging (datum en reden)"]
["Noodzakelijk voor kwaliteitsindicatoren","Nee"]
["Opmerkingen"]
["Zorg Informatie Bouwsteen (ZIB)","ZIB: Verrichting\nContainer (1): \nContainer (2): \nDataelement: VerrichtingType\nOmzetting naar LROI:"]
["Voorbeeld","<screening>1</screening>"]
[]
["Terug naar Overzicht"]

{"sheet":"Robotassistentie gebruikt","index":148,"n_rows":23,"n_cols":2,"rows_kept":23,"cut":false,"hidden":false,"merged":[]}
["DATA_ID",{"$f":"INDEX(Overzicht_unique!$A:$AJ, MATCH($B$2,Overzicht_unique!$A:$A,0), 36)","v":"LROI053, LROI153, LROI242, LROI326, LROI413"}]
["LROI uitvraag","Robotassistentie gebruikt"]
["Variabelenaam XML","robotAssistance"]
["Variabelenaam database","robot_assistance"]
["Label EN","Robot assistance applied"]
["Label NL","Robotassistentie gebruikt"]
["Definitie","Intelligente robot gebruikt tijdens plaatsen prothese"]
["Doel / reden uitvraag","Inzicht in kwaliteit"]
["Waarde verplicht","Functioneel verplicht "]
["Datatype","Integer (INT)"]
["Domein (acceptabele range, min-max)"]
["Eenheid"]
["Format (max. lengte)"]
["Decimalen"]
["Codering (EN/NL)","0=No/ Nee\n1=Yes/ Ja"]
["Periode","LROI-ingrepen v5.1; 01-01-2022"]
["Wijziging (datum en reden)"]
["Noodzakelijk voor kwaliteitsindicatoren","Nee"]
["Opmerkingen"]
["Zorg Informatie Bouwsteen (ZIB)","ZIB: Verrichting\nContainer (1): \nContainer (2): \nDataelement: VerrichtingType\nOmzetting naar LROI:"]
["Voorbeeld","<robotAssistance>1</robotAssistance>"]
[]
["Terug naar Overzicht"]

{"sheet":"Botgraft gebruikt","index":149,"n_rows":23,"n_cols":2,"rows_kept":23,"cut":false,"hidden":false,"merged":[]}
["DATA_ID",{"$f":"INDEX(Overzicht_unique!$A:$AJ, MATCH($B$2,Overzicht_unique!$A:$A,0), 36)","v":"LROI054, LROI154, LROI243, LROI327, LROI414, LROI509, LROI596"}]
["LROI uitvraag","Botgraft gebruikt"]
["Variabelenaam XML","bonegraft"]
["Variabelenaam database","bonegraft"]
["Label EN","Bonegraft used"]
["Label NL","Botgraft gebruikt"]
["Definitie","Een botgraft wordt geplaatst om missend bot op te vullen. Indien er botgraft is gebruikt, specificeer dan of een autograft is gebruikt (bot van de patiënt), een allograft is gebruikt (gedoneerd bot) of dat een combinatie van auto- en allograft is gebruikt."]
["Doel / reden uitvraag","Inzicht in kwaliteit"]
["Waarde verplicht","Functioneel verplicht "]
["Datatype","Integer (INT)"]
["Domein (acceptabele range, min-max)"]
["Eenheid"]
["Format (max. lengte)"]
["Decimalen"]
["Codering (EN/NL)","0=No/ Nee\n1=Yes/ Ja"]
["Periode","Sinds start registratie"]
["Wijziging (datum en reden)","Wijziging heup/knie revisie in LROI-ingrepen v5.1; 01-01-2022. Voorheen “Allograft“. Voor alle gewrichten, zowel primair als revisie, dezelfde vraag “botgraft gebruikt?” met 4 antwoordopties. "]
["Noodzakelijk voor kwaliteitsindicatoren","Nee"]
["Opmerkingen"]
["Zorg Informatie Bouwsteen (ZIB)","ZIB: Verrichting\nContainer (1): \nContainer (2): \nDataelement: VerrichtingType\nOmzetting naar LROI:"]
["Voorbeeld","<bonegraft>1</bonegraft>"]
[]
["Terug naar Overzicht"]

{"sheet":"Patellectomie uitgevoerd","index":150,"n_rows":23,"n_cols":2,"rows_kept":23,"cut":false,"hidden":false,"merged":[]}
["DATA_ID",{"$f":"INDEX(Overzicht_unique!$A:$AJ, MATCH($B$2,Overzicht_unique!$A:$A,0), 36)","v":"LROI148"}]
["LROI uitvraag","Patellectomie uitgevoerd"]
["Variabelenaam XML","patellectomy"]
["Variabelenaam database","patellectomy"]
["Label EN","Patellectomy performed"]
["Label NL","Patellectomie uitgevoerd"]
["Definitie"," Partiële of totale chirurgische verwijdering van de patella"]
["Doel / reden uitvraag","Inzicht in kwaliteit en nevenverrichtingen"]
["Waarde verplicht","Functioneel verplicht "]
["Datatype","Integer (INT)"]
["Domein (acceptabele range, min-max)"]
["Eenheid"]
["Format (max. lengte)"]
["Decimalen"]
["Codering (EN/NL)","0=No/ Nee\n1=Yes/ Ja"]
["Periode","Sinds start registratie"]
["Wijziging (datum en reden)"]
["Noodzakelijk voor kwaliteitsindicatoren","Nee"]
["Opmerkingen"]
["Zorg Informatie Bouwsteen (ZIB)","ZIB: Verrichting\nContainer (1): \nContainer (2): \nDataelement: VerrichtingType\nOmzetting naar LROI:"]
["Voorbeeld","<patellectomy>1</patellectomy>"]
[]
["Terug naar Overzicht"]

{"sheet":"Artrodese uitgevoerd","index":151,"n_rows":23,"n_cols":2,"rows_kept":23,"cut":false,"hidden":false,"merged":[]}
["DATA_ID",{"$f":"INDEX(Overzicht_unique!$A:$AJ, MATCH($B$2,Overzicht_unique!$A:$A,0), 36)","v":"LROI149, LROI239, LROI508, LROI595"}]
["LROI uitvraag","Artrodese uitgevoerd"]
["Variabelenaam XML","arthrodesisPerformed"]
["Variabelenaam database","arthrodesis"]
["Label EN","Arthrodesis performed"]
["Label NL","Artrodese uitgevoerd"]
["Definitie","Procedure waarbij de bewegelijkheid van het gewricht wordt opgeheven door de twee gewrichtsdelen met elkaar te laten vergroeien"]
["Doel / reden uitvraag","Inzicht in kwaliteit en nevenverrichtingen"]
["Waarde verplicht","Functioneel verplicht "]
["Datatype","Integer (INT)"]
["Domein (acceptabele range, min-max)"]
["Eenheid"]
["Format (max. lengte)"]
["Decimalen"]
["Codering (EN/NL)","0=No/ Nee\n1=Yes/ Ja"]
["Periode","Sinds start registratie"]
["Wijziging (datum en reden)"]
["Noodzakelijk voor kwaliteitsindicatoren","Nee"]
["Opmerkingen"]
["Zorg Informatie Bouwsteen (ZIB)","ZIB: Verrichting\nContainer (1): \nContainer (2): \nDataelement: VerrichtingType\nOmzetting naar LROI:"]
["Voorbeeld","<arthrodesisPerformed>1</arthrodesisPerformed>"]
[]
["Terug naar Overzicht"]

{"sheet":"Onder bloedleegte uitgevoerd","index":152,"n_rows":23,"n_cols":2,"rows_kept":23,"cut":false,"hidden":false,"merged":[]}
["DATA_ID",{"$f":"INDEX(Overzicht_unique!$A:$AJ, MATCH($B$2,Overzicht_unique!$A:$A,0), 36)","v":"LROI150"}]
["LROI uitvraag","Onder bloedleegte uitgevoerd"]
["Variabelenaam XML","surgicalTourniquet"]
["Variabelenaam database","tourniquet"]
["Label EN","Surgical tourniquet performed"]
["Label NL","Onder bloedleegte uitgevoerd"]
["Definitie","Procedure vindt (enig moment) plaats in een bloedloos gebied, het gebied \"bloedleeg\" gehouden"]
["Doel / reden uitvraag","Inzicht in kwaliteit"]
["Waarde verplicht","Functioneel verplicht "]
["Datatype","Integer (INT)"]
["Domein (acceptabele range, min-max)"]
["Eenheid"]
["Format (max. lengte)"]
["Decimalen"]
["Codering (EN/NL)","0=No/ Nee\n1=Yes/ Ja"]
["Periode","Sinds LROI-ingrepen v5.1; 01-01-2022"]
["Wijziging (datum en reden)"]
["Noodzakelijk voor kwaliteitsindicatoren","Nee"]
["Opmerkingen"]
["Zorg Informatie Bouwsteen (ZIB)","ZIB: Verrichting\nContainer (1): \nContainer (2): \nDataelement: VerrichtingType\nOmzetting naar LROI:"]
["Voorbeeld","<surgicalTourniquet>1</surgicalTourniquet>"]
[]
["Terug naar Overzicht"]

{"sheet":"Voorgaande operaties","index":153,"n_rows":23,"n_cols":2,"rows_kept":23,"cut":false,"hidden":false,"merged":[]}
["DATA_ID",{"$f":"INDEX(Overzicht_unique!$A:$AJ, MATCH($B$2,Overzicht_unique!$A:$A,0), 36)","v":"LROI055, LROI155, LROI244, LROI328, LROI415, LROI510, LROI597"}]
["LROI uitvraag","Voorgaande operaties"]
["Variabelenaam XML","previousOperations"]
["Variabelenaam database","previous_surgeries"]
["Label EN","Previous operations"]
["Label NL","Voorgaande operaties"]
["Definitie","Voorgaande operaties aan betreffende gewricht"]
["Doel / reden uitvraag","Inzicht in kwaliteit en historie"]
["Waarde verplicht","Functioneel verplicht "]
["Datatype","Integer (INT)"]
["Domein (acceptabele range, min-max)"]
["Eenheid"]
["Format (max. lengte)"]
["Decimalen"]
["Codering (EN/NL)","0=No/ Nee\n1=Yes/ Ja"]
["Periode","Sinds start registratie"]
["Wijziging (datum en reden)"]
["Noodzakelijk voor kwaliteitsindicatoren","Nee"]
["Opmerkingen"]
["Zorg Informatie Bouwsteen (ZIB)","ZIB: \nContainer (1): \nContainer (2): \nDataelement:\nOmzetting naar LROI:"]
["Voorbeeld","<previousOperations>1</previousOperations>"]
[]
["Terug naar Overzicht"]

{"sheet":"Osteosynthese","index":154,"n_rows":23,"n_cols":2,"rows_kept":23,"cut":false,"hidden":false,"merged":[]}
["DATA_ID",{"$f":"INDEX(Overzicht_unique!$A:$AJ, MATCH($B$2,Overzicht_unique!$A:$A,0), 36)","v":"LROI056, LROI159, LROI245, LROI329, LROI416"}]
["LROI uitvraag","Osteosynthese"]
["Variabelenaam XML","osteosynthesis"]
["Variabelenaam database","ps_osteosynthesis"]
["Label EN","Osteosynthesis"]
["Label NL","Osteosynthese"]
["Definitie","Repositie en fixatie van fracturen of pseudoartrose met behulp van (een combinatie van) metalen platen, pennen en/of schroeven"]
["Doel / reden uitvraag","Inzicht in kwaliteit en historie"]
["Waarde verplicht","Functioneel verplicht "]
["Datatype","Integer (INT)"]
["Domein (acceptabele range, min-max)"]
["Eenheid"]
["Format (max. lengte)"]
["Decimalen"]
["Codering (EN/NL)","0=No/ Nee\n1=Yes/ Ja"]
["Periode","Sinds start registratie"]
["Wijziging (datum en reden)"]
["Noodzakelijk voor kwaliteitsindicatoren","Nee"]
["Opmerkingen"]
["Zorg Informatie Bouwsteen (ZIB)","ZIB: Verrichting\nContainer (1): \nContainer (2): \nDataelement: VerrichtingType; VerrichtingLateraliteit; VerrichtingStartDatum\nOmzetting naar LROI:"]
["Voorbeeld","<osteosynthesis>1</osteosynthesis>"]
[]
["Terug naar Overzicht"]

{"sheet":"Osteotomie","index":155,"n_rows":23,"n_cols":2,"rows_kept":23,"cut":false,"hidden":false,"merged":[]}
["DATA_ID",{"$f":"INDEX(Overzicht_unique!$A:$AJ, MATCH($B$2,Overzicht_unique!$A:$A,0), 36)","v":"LROI057, LROI157, LROI246"}]
["LROI uitvraag","Osteotomie"]
["Variabelenaam XML","osteotomy"]
["Variabelenaam database","ps_osteotomy"]
["Label EN","Osteotomy"]
["Label NL","Osteotomie"]
["Definitie","Operatie waarbij het bot doorgezaagd of doorgenomen wordt met als doel scheefstand van een bot te corrigeren of de belasting op het gewricht te veranderen"]
["Doel / reden uitvraag","Inzicht in kwaliteit en historie"]
["Waarde verplicht","Functioneel verplicht "]
["Datatype","Integer (INT)"]
["Domein (acceptabele range, min-max)"]
["Eenheid"]
["Format (max. lengte)"]
["Decimalen"]
["Codering (EN/NL)","0=No/ Nee\n1=Yes/ Ja"]
["Periode","Sinds start registratie"]
["Wijziging (datum en reden)"]
["Noodzakelijk voor kwaliteitsindicatoren","Nee"]
["Opmerkingen"]
["Zorg Informatie Bouwsteen (ZIB)","ZIB: Verrichting\nContainer (1): \nContainer (2): \nDataelement: VerrichtingType; VerrichtingLateraliteit; VerrichtingStartDatum\nOmzetting naar LROI:"]
["Voorbeeld","<osteotomy>1</osteotomy>"]
[]
["Terug naar Overzicht"]

{"sheet":"Artrodese","index":156,"n_rows":23,"n_cols":2,"rows_kept":23,"cut":false,"hidden":false,"merged":[]}
["DATA_ID",{"$f":"INDEX(Overzicht_unique!$A:$AJ, MATCH($B$2,Overzicht_unique!$A:$A,0), 36)","v":"LROI058, LROI253, LROI599"}]
["LROI uitvraag","Artrodese"]
["Variabelenaam XML","arthrodesis"]
["Variabelenaam database","ps_arthrodesis"]
["Label EN","Arthrodesis"]
["Label NL","Artrodese"]
["Definitie","Procedure waarbij de bewegelijkheid van het gewricht wordt opgeheven door de twee gewrichtsdelen met elkaar te laten vergroeien"]
["Doel / reden uitvraag","Inzicht in kwaliteit en historie"]
["Waarde verplicht","Functioneel verplicht "]
["Datatype","Integer (INT)"]
["Domein (acceptabele range, min-max)"]
["Eenheid"]
["Format (max. lengte)"]
["Decimalen"]
["Codering (EN/NL)","0=No/ Nee\n1=Yes/ Ja"]
["Periode","Sinds start registratie"]
["Wijziging (datum en reden)"]
["Noodzakelijk voor kwaliteitsindicatoren","Nee"]
["Opmerkingen"]
["Zorg Informatie Bouwsteen (ZIB)","ZIB: Verrichting\nContainer (1): \nContainer (2): \nDataelement: VerrichtingType; VerrichtingLateraliteit; VerrichtingStartDatum\nOmzetting naar LROI:"]
["Voorbeeld","<arthrodesis>1</arthrodesis>"]
[]
["Terug naar Overzicht"]

{"sheet":"Girdlestone","index":157,"n_rows":23,"n_cols":2,"rows_kept":23,"cut":false,"hidden":false,"merged":[]}
["DATA_ID",{"$f":"INDEX(Overzicht_unique!$A:$AJ, MATCH($B$2,Overzicht_unique!$A:$A,0), 36)","v":"LROI059"}]
["LROI uitvraag","Girdlestone"]
["Variabelenaam XML","girdlestone"]
["Variabelenaam database","ps_girdlestone"]
["Label EN","Girdlestone"]
["Label NL","Girdlestone"]
["Definitie","Operatie waarbij een deel van de heupkop is verwijderd zonder terugplaatsing van een prothese of metalen plaat"]
["Doel / reden uitvraag","Inzicht in kwaliteit en historie"]
["Waarde verplicht","Functioneel verplicht "]
["Datatype","Integer (INT)"]
["Domein (acceptabele range, min-max)"]
["Eenheid"]
["Format (max. lengte)"]
["Decimalen"]
["Codering (EN/NL)","0=No/ Nee\n1=Yes/ Ja"]
["Periode","Sinds start registratie"]
["Wijziging (datum en reden)"]
["Noodzakelijk voor kwaliteitsindicatoren","Nee"]
["Opmerkingen"]
["Zorg Informatie Bouwsteen (ZIB)","ZIB: Verrichting\nContainer (1): \nContainer (2): \nDataelement: VerrichtingType; VerrichtingLateraliteit; VerrichtingStartDatum\nOmzetting naar LROI:"]
["Voorbeeld","<girdlestone>1</girdlestone>"]
[]
["Terug naar Overzicht"]

{"sheet":"Artroscopie","index":158,"n_rows":23,"n_cols":2,"rows_kept":23,"cut":false,"hidden":false,"merged":[]}
["DATA_ID",{"$f":"INDEX(Overzicht_unique!$A:$AJ, MATCH($B$2,Overzicht_unique!$A:$A,0), 36)","v":"LROI060, LROI161, LROI248, LROI420"}]
["LROI uitvraag","Artroscopie"]
["Variabelenaam XML","arthroscopy"]
["Variabelenaam database","ps_arthroscopy"]
["Label EN","Arthroscopy"]
["Label NL","Artroscopie"]
["Definitie","Alle artroscopische procedures gerelateerd aan het gewricht (inclusief artroscopische nettoyage)"]
["Doel / reden uitvraag","Inzicht in kwaliteit en historie"]
["Waarde verplicht","Functioneel verplicht "]
["Datatype","Integer (INT)"]
["Domein (acceptabele range, min-max)"]
["Eenheid"]
["Format (max. lengte)"]
["Decimalen"]
["Codering (EN/NL)","0=No/ Nee\n1=Yes/ Ja"]
["Periode","Sinds start registratie"]
["Wijziging (datum en reden)","Definitie gewijzigd voor knie in LROI-ingrepen v5.1; 01-01-2022. Definitie: Alle artroscopische procedures gerelateerd aan het kniegewricht (inclusief artroscopische nettoyage), eventueel met partiële meniscectomie. "]
["Noodzakelijk voor kwaliteitsindicatoren","Nee"]
["Opmerkingen"]
["Zorg Informatie Bouwsteen (ZIB)","ZIB: Verrichting\nContainer (1): \nContainer (2): \nDataelement: VerrichtingType; VerrichtingLateraliteit; VerrichtingStartDatum\nOmzetting naar LROI:"]
["Voorbeeld","<arthroscopy>1</arthroscopy>"]
[]
["Terug naar Overzicht"]

{"sheet":"Open meniscectomie","index":159,"n_rows":23,"n_cols":2,"rows_kept":23,"cut":false,"hidden":false,"merged":[]}
["DATA_ID",{"$f":"INDEX(Overzicht_unique!$A:$AJ, MATCH($B$2,Overzicht_unique!$A:$A,0), 36)","v":"LROI156"}]
["LROI uitvraag","Open meniscectomie"]
["Variabelenaam XML","meniscectomy"]
["Variabelenaam database","ps_meniscectomy"]
["Label EN","Open Meniscectomy"]
["Label NL","Open meniscectomie"]
["Definitie","Verwijdering van (een deel van) de meniscus"]
["Doel / reden uitvraag","Inzicht in kwaliteit en historie"]
["Waarde verplicht","Functioneel verplicht "]
["Datatype","Integer (INT)"]
["Domein (acceptabele range, min-max)"]
["Eenheid"]
["Format (max. lengte)"]
["Decimalen"]
["Codering (EN/NL)","0=No/ Nee\n1=Yes/ Ja"]
["Periode","Sinds start registratie"]
["Wijziging (datum en reden)","Term gewijzigd in LROI-ingrepen v5.1; 01-01-2022. Voorheen \"Meniscectomie\". "]
["Noodzakelijk voor kwaliteitsindicatoren","Nee"]
["Opmerkingen"]
["Zorg Informatie Bouwsteen (ZIB)","ZIB: Verrichting\nContainer (1): \nContainer (2): \nDataelement: VerrichtingType; VerrichtingLateraliteit; VerrichtingStartDatum\nOmzetting naar LROI:"]
["Voorbeeld","<meniscectomy>1</meniscectomy>"]
[]
["Terug naar Overzicht"]

{"sheet":"Voorste kruisband reconstructie","index":160,"n_rows":23,"n_cols":2,"rows_kept":23,"cut":false,"hidden":false,"merged":[]}
["DATA_ID",{"$f":"INDEX(Overzicht_unique!$A:$AJ, MATCH($B$2,Overzicht_unique!$A:$A,0), 36)","v":"LROI158"}]
["LROI uitvraag","Voorste kruisband reconstructie"]
["Variabelenaam XML","aclReconstruction"]
["Variabelenaam database","ps_front_ligament_rec"]
["Label EN","ACL-Reconstruction"]
["Label NL","Voorste kruisband reconstructie"]
["Definitie","Chirurgische reconstructie van de voorste kruisband/anterieure cruciate ligament (ACL)"]
["Doel / reden uitvraag","Inzicht in kwaliteit en historie"]
["Waarde verplicht","Functioneel verplicht "]
["Datatype","Integer (INT)"]
["Domein (acceptabele range, min-max)"]
["Eenheid"]
["Format (max. lengte)"]
["Decimalen"]
["Codering (EN/NL)","0=No/ Nee\n1=Yes/ Ja"]
["Periode","Sinds start registratie"]
["Wijziging (datum en reden)"]
["Noodzakelijk voor kwaliteitsindicatoren","Nee"]
["Opmerkingen"]
["Zorg Informatie Bouwsteen (ZIB)","ZIB: Verrichting\nContainer (1): \nContainer (2): \nDataelement: VerrichtingType; VerrichtingLateraliteit; VerrichtingStartDatum\nOmzetting naar LROI:"]
["Voorbeeld","<aclReconstruction>1</aclReconstruction>"]
[]
["Terug naar Overzicht"]

{"sheet":"Synovectomie","index":161,"n_rows":23,"n_cols":2,"rows_kept":23,"cut":false,"hidden":false,"merged":[]}
["DATA_ID",{"$f":"INDEX(Overzicht_unique!$A:$AJ, MATCH($B$2,Overzicht_unique!$A:$A,0), 36)","v":"LROI160, LROI247"}]
["LROI uitvraag","Synovectomie"]
["Variabelenaam XML","synovectomy"]
["Variabelenaam database","ps_synovectomy"]
["Label EN","Synovectomy"]
["Label NL","Synovectomie"]
["Definitie","Verwijdering van een deel of van het gehele synoviale membraan van de knie/enkel"]
["Doel / reden uitvraag","Inzicht in kwaliteit en historie"]
["Waarde verplicht","Functioneel verplicht "]
["Datatype","Integer (INT)"]
["Domein (acceptabele range, min-max)"]
["Eenheid"]
["Format (max. lengte)"]
["Decimalen"]
["Codering (EN/NL)","0=No/ Nee\n1=Yes/ Ja"]
["Periode","Sinds start registratie"]
["Wijziging (datum en reden)"]
["Noodzakelijk voor kwaliteitsindicatoren","Nee"]
["Opmerkingen"]
["Zorg Informatie Bouwsteen (ZIB)","ZIB: Verrichting\nContainer (1): \nContainer (2): \nDataelement: VerrichtingType; VerrichtingLateraliteit; VerrichtingStartDatum\nOmzetting naar LROI:"]
["Voorbeeld","<synovectomy>1</synovectomy>"]
[]
["Terug naar Overzicht"]

{"sheet":"Patella realignment procedure","index":162,"n_rows":23,"n_cols":2,"rows_kept":23,"cut":false,"hidden":false,"merged":[]}
["DATA_ID",{"$f":"INDEX(Overzicht_unique!$A:$AJ, MATCH($B$2,Overzicht_unique!$A:$A,0), 36)","v":"LROI162"}]
["LROI uitvraag","Patella realignment procedure"]
["Variabelenaam XML","patellaRealignment"]
["Variabelenaam database","ps_patella_realignment"]
["Label EN","Patella realignment procedure"]
["Label NL","Patella realignment procedure"]
["Definitie","Procedure om de alignment van de patella te verbeteren (bijvoorbeeld tuberositas osteotomie, lateraal vrijmaken, Albee procedure of mediale plicatie)"]
["Doel / reden uitvraag","Inzicht in kwaliteit en historie"]
["Waarde verplicht","Functioneel verplicht "]
["Datatype","Integer (INT)"]
["Domein (acceptabele range, min-max)"]
["Eenheid"]
["Format (max. lengte)"]
["Decimalen"]
["Codering (EN/NL)","0=No/ Nee\n1=Yes/ Ja"]
["Periode","Sinds start registratie"]
["Wijziging (datum en reden)"]
["Noodzakelijk voor kwaliteitsindicatoren","Nee"]
["Opmerkingen"]
["Zorg Informatie Bouwsteen (ZIB)","ZIB: Verrichting\nContainer (1): \nContainer (2): \nDataelement: VerrichtingType; VerrichtingLateraliteit; VerrichtingStartDatum\nOmzetting naar LROI:"]
["Voorbeeld","<patellaRealignment>1</patellaRealignment>"]
[]
["Terug naar Overzicht"]

{"sheet":"Knie distractie","index":163,"n_rows":23,"n_cols":2,"rows_kept":23,"cut":false,"hidden":false,"merged":[]}
["DATA_ID",{"$f":"INDEX(Overzicht_unique!$A:$AJ, MATCH($B$2,Overzicht_unique!$A:$A,0), 36)","v":"LROI163"}]
["LROI uitvraag","Knie distractie"]
["Variabelenaam XML","kneeDistraction"]
["Variabelenaam database","ps_knee_distraction"]
["Label EN","Knee distraction"]
["Label NL","Knie distractie"]
["Definitie","Behandeling waarbij een frame aan de buitenkant van de artrose knie ervoor zorgt dat de gewrichtsoppervlakken elkaar niet kunnen raken (voor een aantal weken tot maanden)"]
["Doel / reden uitvraag","Inzicht in kwaliteit en historie"]
["Waarde verplicht","Functioneel verplicht "]
["Datatype","Integer (INT)"]
["Domein (acceptabele range, min-max)"]
["Eenheid"]
["Format (max. lengte)"]
["Decimalen"]
["Codering (EN/NL)","0=No/ Nee\n1=Yes/ Ja"]
["Periode","Sinds LROI-ingrepen v5.1; 01-01-2022"]
["Wijziging (datum en reden)"]
["Noodzakelijk voor kwaliteitsindicatoren","Nee"]
["Opmerkingen"]
["Zorg Informatie Bouwsteen (ZIB)","ZIB: Verrichting\nContainer (1): \nContainer (2): \nDataelement: VerrichtingType; VerrichtingLateraliteit; VerrichtingStartDatum\nOmzetting naar LROI:"]
["Voorbeeld","<kneeDistraction>1<kneeDistraction>"]
[]
["Terug naar Overzicht"]

{"sheet":"Behandeling osteochondraal botd","index":164,"n_rows":23,"n_cols":2,"rows_kept":23,"cut":false,"hidden":false,"merged":[]}
["DATA_ID",{"$f":"INDEX(Overzicht_unique!$A:$AJ, MATCH($B$2,Overzicht_unique!$A:$A,0), 36)","v":"LROI249"}]
["LROI uitvraag","Behandeling osteochondraal botdefect"]
["Variabelenaam XML","ocdTreatment"]
["Variabelenaam database","ps_ocd_treatment"]
["Label EN","OCD treatment"]
["Label NL","Behandeling osteochondraal botdefect"]
["Definitie","Behandeling van osteochondritis dissecans (OCD)"]
["Doel / reden uitvraag","Inzicht in kwaliteit en historie"]
["Waarde verplicht","Functioneel verplicht "]
["Datatype","Integer (INT)"]
["Domein (acceptabele range, min-max)"]
["Eenheid"]
["Format (max. lengte)"]
["Decimalen"]
["Codering (EN/NL)","0=No/ Nee\n1=Yes/ Ja"]
["Periode","Sinds start registratie"]
["Wijziging (datum en reden)"]
["Noodzakelijk voor kwaliteitsindicatoren","Nee"]
["Opmerkingen"]
["Zorg Informatie Bouwsteen (ZIB)","ZIB: Verrichting\nContainer (1): \nContainer (2): \nDataelement: VerrichtingType; VerrichtingLateraliteit; VerrichtingStartDatum\nOmzetting naar LROI:"]
["Voorbeeld","<ocdTreatment>1</ocdTreatment>"]
[]
["Terug naar Overzicht"]

{"sheet":"Ligament reconstructie","index":165,"n_rows":23,"n_cols":2,"rows_kept":23,"cut":false,"hidden":false,"merged":[]}
["DATA_ID",{"$f":"INDEX(Overzicht_unique!$A:$AJ, MATCH($B$2,Overzicht_unique!$A:$A,0), 36)","v":"LROI250"}]
["LROI uitvraag","Ligament reconstructie"]
["Variabelenaam XML","previousOperationsLigamentReconstruction"]
["Variabelenaam database","ps_ligament_reconstr"]
["Label EN","Ligament Reconstruction"]
["Label NL","Ligament reconstructie"]
["Definitie","Reconstructie van het mediale of laterale ligament van de enkel"]
["Doel / reden uitvraag","Inzicht in kwaliteit en historie"]
["Waarde verplicht","Functioneel verplicht "]
["Datatype","Integer (INT)"]
["Domein (acceptabele range, min-max)"]
["Eenheid"]
["Format (max. lengte)"]
["Decimalen"]
["Codering (EN/NL)","0=No/ Nee\n1=Yes/ Ja"]
["Periode","Sinds start registratie"]
["Wijziging (datum en reden)"]
["Noodzakelijk voor kwaliteitsindicatoren","Nee"]
["Opmerkingen"]
["Zorg Informatie Bouwsteen (ZIB)","ZIB: Verrichting\nContainer (1): \nContainer (2): \nDataelement: VerrichtingType; VerrichtingLateraliteit; VerrichtingStartDatum\nOmzetting naar LROI:"]
["Voorbeeld","<previousOperationsLigamentReconstruction>1</previousOperationsLigamentReconstruction>"]
[]
["Terug naar Overzicht"]

{"sheet":"Achtervoetchirurgie","index":166,"n_rows":23,"n_cols":2,"rows_kept":23,"cut":false,"hidden":false,"merged":[]}
["DATA_ID",{"$f":"INDEX(Overzicht_unique!$A:$AJ, MATCH($B$2,Overzicht_unique!$A:$A,0), 36)","v":"LROI251"}]
["LROI uitvraag","Achtervoetchirurgie"]
["Variabelenaam XML","hindfootSurgery"]
["Variabelenaam database","ps_hindfoot_surgery"]
["Label EN","Hindfoot surgery"]
["Label NL","Achtervoetchirurgie"]
["Definitie","Chirurgie aan het achterste gedeelte van de voet"]
["Doel / reden uitvraag","Inzicht in kwaliteit en historie"]
["Waarde verplicht","Functioneel verplicht "]
["Datatype","Integer (INT)"]
["Domein (acceptabele range, min-max)"]
["Eenheid"]
["Format (max. lengte)"]
["Decimalen"]
["Codering (EN/NL)","0=No/ Nee\n1=Yes/ Ja"]
["Periode","Sinds start registratie"]
["Wijziging (datum en reden)"]
["Noodzakelijk voor kwaliteitsindicatoren","Nee"]
["Opmerkingen"]
["Zorg Informatie Bouwsteen (ZIB)","ZIB: Verrichting\nContainer (1): \nContainer (2): \nDataelement: VerrichtingType; VerrichtingLateraliteit; VerrichtingStartDatum\nOmzetting naar LROI:"]
["Voorbeeld","<hindfootSurgery>1</hindfootSurgery>"]
[]
["Terug naar Overzicht"]

{"sheet":"Voorvoetchirurgie","index":167,"n_rows":23,"n_cols":2,"rows_kept":23,"cut":false,"hidden":false,"merged":[]}
["DATA_ID",{"$f":"INDEX(Overzicht_unique!$A:$AJ, MATCH($B$2,Overzicht_unique!$A:$A,0), 36)","v":"LROI252"}]
["LROI uitvraag","Voorvoetchirurgie"]
["Variabelenaam XML","forefootSurgery"]
["Variabelenaam database","ps_forefoot_surgery"]
["Label EN","Hindfoot surgery"]
["Label NL","Forefoot surgery"]
["Definitie","Chirurgie aan het voorste gedeelte van de voet"]
["Doel / reden uitvraag","Inzicht in kwaliteit en historie"]
["Waarde verplicht","Functioneel verplicht "]
["Datatype","Integer (INT)"]
["Domein (acceptabele range, min-max)"]
["Eenheid"]
["Format (max. lengte)"]
["Decimalen"]
["Codering (EN/NL)","0=No/ Nee\n1=Yes/ Ja"]
["Periode","Sinds start registratie"]
["Wijziging (datum en reden)"]
["Noodzakelijk voor kwaliteitsindicatoren","Nee"]
["Opmerkingen"]
["Zorg Informatie Bouwsteen (ZIB)","ZIB: Verrichting\nContainer (1): \nContainer (2): \nDataelement: VerrichtingType; VerrichtingLateraliteit; VerrichtingStartDatum\nOmzetting naar LROI:"]
["Voorbeeld","<forefootSurgery>1</forefootSurgery>"]
[]
["Terug naar Overzicht"]

{"sheet":"Acromioplastiek","index":168,"n_rows":23,"n_cols":2,"rows_kept":23,"cut":false,"hidden":false,"merged":[]}
["DATA_ID",{"$f":"INDEX(Overzicht_unique!$A:$AJ, MATCH($B$2,Overzicht_unique!$A:$A,0), 36)","v":"LROI330"}]
["LROI uitvraag","Acromioplastiek"]
["Variabelenaam XML","prevAcromioplasty"]
["Variabelenaam database","ps_acromioplasty"]
["Label EN","Acromioplasty"]
["Label NL","Acromioplastiek"]
["Definitie"," Operatieve verwijdering van bursaweefsel en vergroting van de subacromiale ruimte door het verwijderen van een benig impingement van het acromion"]
["Doel / reden uitvraag","Inzicht in kwaliteit en historie"]
["Waarde verplicht","Functioneel verplicht "]
["Datatype","Integer (INT)"]
["Domein (acceptabele range, min-max)"]
["Eenheid"]
["Format (max. lengte)"]
["Decimalen"]
["Codering (EN/NL)","0=No/ Nee\n1=Yes/ Ja"]
["Periode","Sinds start registratie"]
["Wijziging (datum en reden)"]
["Noodzakelijk voor kwaliteitsindicatoren","Nee"]
["Opmerkingen"]
["Zorg Informatie Bouwsteen (ZIB)","ZIB: Verrichting\nContainer (1): \nContainer (2): \nDataelement: VerrichtingType; VerrichtingLateraliteit; VerrichtingStartDatum\nOmzetting naar LROI:"]
["Voorbeeld","<prevAcromioplasty>1</prevAcromioplasty>"]
[]
["Terug naar Overzicht"]

{"sheet":"Herstellen van de rotator cuff","index":169,"n_rows":23,"n_cols":2,"rows_kept":23,"cut":false,"hidden":false,"merged":[]}
["DATA_ID",{"$f":"INDEX(Overzicht_unique!$A:$AJ, MATCH($B$2,Overzicht_unique!$A:$A,0), 36)","v":"LROI331"}]
["LROI uitvraag","Herstellen van de rotator cuff"]
["Variabelenaam XML","rotatorCuffRepair"]
["Variabelenaam database","ps_recovery_rotator_cuff"]
["Label EN","Rotator cuff repair"]
["Label NL","Herstellen van de rotator cuff"]
["Definitie","Herstellen van de rotator cuff"]
["Doel / reden uitvraag","Inzicht in kwaliteit en historie"]
["Waarde verplicht","Functioneel verplicht "]
["Datatype","Integer (INT)"]
["Domein (acceptabele range, min-max)"]
["Eenheid"]
["Format (max. lengte)"]
["Decimalen"]
["Codering (EN/NL)","0=No/ Nee\n1=Yes/ Ja"]
["Periode","Sinds start registratie"]
["Wijziging (datum en reden)"]
["Noodzakelijk voor kwaliteitsindicatoren","Nee"]
["Opmerkingen"]
["Zorg Informatie Bouwsteen (ZIB)","ZIB: Verrichting\nContainer (1): \nContainer (2): \nDataelement: VerrichtingType; VerrichtingLateraliteit; VerrichtingStartDatum\nOmzetting naar LROI:"]
["Voorbeeld","<rotatorCuffRepair>1</rotatorCuffRepair>"]
[]
["Terug naar Overzicht"]

{"sheet":"Distale clavicula resectie","index":170,"n_rows":23,"n_cols":2,"rows_kept":23,"cut":false,"hidden":false,"merged":[]}
["DATA_ID",{"$f":"INDEX(Overzicht_unique!$A:$AJ, MATCH($B$2,Overzicht_unique!$A:$A,0), 36)","v":"LROI332"}]
["LROI uitvraag","Distale clavicula resectie"]
["Variabelenaam XML","prevDistalClavicleResection"]
["Variabelenaam database","ps_dist_clavicle_res"]
["Label EN","Distal clavicle resection"]
["Label NL","Distale clavicula resectie"]
["Definitie","Verwijderen van het distale uiteinde van de clavicula"]
["Doel / reden uitvraag","Inzicht in kwaliteit en historie"]
["Waarde verplicht","Functioneel verplicht "]
["Datatype","Integer (INT)"]
["Domein (acceptabele range, min-max)"]
["Eenheid"]
["Format (max. lengte)"]
["Decimalen"]
["Codering (EN/NL)","0=No/ Nee\n1=Yes/ Ja"]
["Periode","Sinds start registratie"]
["Wijziging (datum en reden)"]
["Noodzakelijk voor kwaliteitsindicatoren","Nee"]
["Opmerkingen"]
["Zorg Informatie Bouwsteen (ZIB)","ZIB: Verrichting\nContainer (1): \nContainer (2): \nDataelement: VerrichtingType; VerrichtingLateraliteit; VerrichtingStartDatum\nOmzetting naar LROI:"]
["Voorbeeld","<prevDistalClavicleResection>1</prevDistalClavicleResection>"]
[]
["Terug naar Overzicht"]

{"sheet":"Stabilisatieprocedure","index":171,"n_rows":23,"n_cols":2,"rows_kept":23,"cut":false,"hidden":false,"merged":[]}
["DATA_ID",{"$f":"INDEX(Overzicht_unique!$A:$AJ, MATCH($B$2,Overzicht_unique!$A:$A,0), 36)","v":"LROI333"}]
["LROI uitvraag","Stabilisatieprocedure"]
["Variabelenaam XML","stabilisationProcedure"]
["Variabelenaam database","ps_stabil_procedure"]
["Label EN","Stabilisation procedure"]
["Label NL","Stabilisatieprocedure"]
["Definitie","Chirurgische ingreep om de stabilisatie van de schouder te herstellen, waaronder Labrum repair, Capsular shift en Lateriet procedure"]
["Doel / reden uitvraag","Inzicht in kwaliteit en historie"]
["Waarde verplicht","Functioneel verplicht "]
["Datatype","Integer (INT)"]
["Domein (acceptabele range, min-max)"]
["Eenheid"]
["Format (max. lengte)"]
["Decimalen"]
["Codering (EN/NL)","0=No/ Nee\n1=Yes/ Ja"]
["Periode","Sinds start registratie"]
["Wijziging (datum en reden)","Definitie gewijzigd in LROI-ingrepen v5.1; 01-01-2022. \"waaronder Labrum repair, Capsular shift en Laterjet procedure\" toegevoegd in definitie."]
["Noodzakelijk voor kwaliteitsindicatoren","Nee"]
["Opmerkingen"]
["Zorg Informatie Bouwsteen (ZIB)","ZIB: Verrichting\nContainer (1): \nContainer (2): \nDataelement: VerrichtingType; VerrichtingLateraliteit; VerrichtingStartDatum\nOmzetting naar LROI:"]
["Voorbeeld","<stabilisationProcedure>1</stabilisationProcedure>"]
[]
["Terug naar Overzicht"]

{"sheet":"Tenotomie bicepspees","index":172,"n_rows":23,"n_cols":2,"rows_kept":23,"cut":false,"hidden":false,"merged":[]}
["DATA_ID",{"$f":"INDEX(Overzicht_unique!$A:$AJ, MATCH($B$2,Overzicht_unique!$A:$A,0), 36)","v":"LROI334"}]
["LROI uitvraag","Tenotomie bicepspees"]
["Variabelenaam XML","tenotomyBiceps"]
["Variabelenaam database","ps_tenotomy_biceps"]
["Label EN","Tenotomy biceps tendon"]
["Label NL","Tenotomie bicepspees"]
["Definitie","Doornemen van de lange kop van de bicepspees"]
["Doel / reden uitvraag","Inzicht in kwaliteit en historie"]
["Waarde verplicht","Functioneel verplicht "]
["Datatype","Integer (INT)"]
["Domein (acceptabele range, min-max)"]
["Eenheid"]
["Format (max. lengte)"]
["Decimalen"]
["Codering (EN/NL)","0=No/ Nee\n1=Yes/ Ja"]
["Periode","Sinds LROI-ingrepen v5.1; 01-01-2022"]
["Wijziging (datum en reden)"]
["Noodzakelijk voor kwaliteitsindicatoren","Nee"]
["Opmerkingen"]
["Zorg Informatie Bouwsteen (ZIB)","ZIB: Verrichting\nContainer (1): \nContainer (2): \nDataelement: VerrichtingType; VerrichtingLateraliteit; VerrichtingStartDatum\nOmzetting naar LROI:"]
["Voorbeeld","<tenotomyBiceps>1</tenotomyBiceps>"]
[]
["Terug naar Overzicht"]

{"sheet":"Tenodesis bicepspees","index":173,"n_rows":23,"n_cols":2,"rows_kept":23,"cut":false,"hidden":false,"merged":[]}
["DATA_ID",{"$f":"INDEX(Overzicht_unique!$A:$AJ, MATCH($B$2,Overzicht_unique!$A:$A,0), 36)","v":"LROI335"}]
["LROI uitvraag","Tenodesis bicepspees"]
["Variabelenaam XML","tenodesisBiceps"]
["Variabelenaam database","ps_tenodesis_biceps"]
["Label EN","Tenodesis biceps tendon"]
["Label NL","Tenodesis bicepspees"]
["Definitie","Vastzetten van de lange kop van de bicepspees"]
["Doel / reden uitvraag","Inzicht in kwaliteit en historie"]
["Waarde verplicht","Functioneel verplicht "]
["Datatype","Integer (INT)"]
["Domein (acceptabele range, min-max)"]
["Eenheid"]
["Format (max. lengte)"]
["Decimalen"]
["Codering (EN/NL)","0=No/ Nee\n1=Yes/ Ja"]
["Periode","Sinds LROI-ingrepen v5.1; 01-01-2022"]
["Wijziging (datum en reden)"]
["Noodzakelijk voor kwaliteitsindicatoren","Nee"]
["Opmerkingen"]
["Zorg Informatie Bouwsteen (ZIB)","ZIB: Verrichting\nContainer (1): \nContainer (2): \nDataelement: VerrichtingType; VerrichtingLateraliteit; VerrichtingStartDatum\nOmzetting naar LROI:"]
["Voorbeeld","<tenodesisBiceps>1</tenodesisBiceps>"]
[]
["Terug naar Overzicht"]

{"sheet":"Laterale artrotomie","index":174,"n_rows":23,"n_cols":2,"rows_kept":23,"cut":false,"hidden":false,"merged":[]}
["DATA_ID",{"$f":"INDEX(Overzicht_unique!$A:$AJ, MATCH($B$2,Overzicht_unique!$A:$A,0), 36)","v":"LROI417"}]
["LROI uitvraag","Laterale artrotomie"]
["Variabelenaam XML","arthrotomyLateral"]
["Variabelenaam database","ps_lat_arthrotomy"]
["Label EN","Arthrotomy lateral"]
["Label NL","Laterale artrotomie"]
["Definitie","Het chirurgisch openen van een gewricht, via de laterale zijde"]
["Doel / reden uitvraag","Inzicht in kwaliteit en historie"]
["Waarde verplicht","Functioneel verplicht "]
["Datatype","Integer (INT)"]
["Domein (acceptabele range, min-max)"]
["Eenheid"]
["Format (max. lengte)"]
["Decimalen"]
["Codering (EN/NL)","0=No/ Nee\n1=Yes/ Ja"]
["Periode","Sinds start registratie"]
["Wijziging (datum en reden)"]
["Noodzakelijk voor kwaliteitsindicatoren","Nee"]
["Opmerkingen"]
["Zorg Informatie Bouwsteen (ZIB)","ZIB: Verrichting\nContainer (1): \nContainer (2): \nDataelement: VerrichtingType; VerrichtingLateraliteit; VerrichtingStartDatum\nOmzetting naar LROI:"]
["Voorbeeld","<arthrotomyLateral>1</arthrotomyLateral>"]
[]
["Terug naar Overzicht"]

{"sheet":"Mediale artrotomie","index":175,"n_rows":23,"n_cols":2,"rows_kept":23,"cut":false,"hidden":false,"merged":[]}
["DATA_ID",{"$f":"INDEX(Overzicht_unique!$A:$AJ, MATCH($B$2,Overzicht_unique!$A:$A,0), 36)","v":"LROI418"}]
["LROI uitvraag","Mediale artrotomie"]
["Variabelenaam XML","arthrotomyMedial"]
["Variabelenaam database","ps_med_arthrotomy"]
["Label EN","Arthrotomy medial"]
["Label NL","Mediale artrotomie"]
["Definitie","Het chirurgisch openen van een gewricht, via de mediale zijde"]
["Doel / reden uitvraag","Inzicht in kwaliteit en historie"]
["Waarde verplicht","Functioneel verplicht "]
["Datatype","Integer (INT)"]
["Domein (acceptabele range, min-max)"]
["Eenheid"]
["Format (max. lengte)"]
["Decimalen"]
["Codering (EN/NL)","0=No/ Nee\n1=Yes/ Ja"]
["Periode","Sinds start registratie"]
["Wijziging (datum en reden)"]
["Noodzakelijk voor kwaliteitsindicatoren","Nee"]
["Opmerkingen"]
["Zorg Informatie Bouwsteen (ZIB)","ZIB: Verrichting\nContainer (1): \nContainer (2): \nDataelement: VerrichtingType; VerrichtingLateraliteit; VerrichtingStartDatum\nOmzetting naar LROI:"]
["Voorbeeld","<arthrotomyMedial>1</arthrotomyMedial>"]
[]
["Terug naar Overzicht"]

{"sheet":"Posterieure artrotomie","index":176,"n_rows":23,"n_cols":2,"rows_kept":23,"cut":false,"hidden":false,"merged":[]}
["DATA_ID",{"$f":"INDEX(Overzicht_unique!$A:$AJ, MATCH($B$2,Overzicht_unique!$A:$A,0), 36)","v":"LROI419"}]
["LROI uitvraag","Posterieure artrotomie"]
["Variabelenaam XML","arthrotomyPosterior"]
["Variabelenaam database","ps_post_arthrotomy"]
["Label EN","Arthrotomy posterior"]
["Label NL","Posterieure artrotomie"]
["Definitie","Het chirurgisch openen van een gewricht, via de posterieure zijde"]
["Doel / reden uitvraag","Inzicht in kwaliteit en historie"]
["Waarde verplicht","Functioneel verplicht "]
["Datatype","Integer (INT)"]
["Domein (acceptabele range, min-max)"]
["Eenheid"]
["Format (max. lengte)"]
["Decimalen"]
["Codering (EN/NL)","0=No/ Nee\n1=Yes/ Ja"]
["Periode","Sinds start registratie"]
["Wijziging (datum en reden)"]
["Noodzakelijk voor kwaliteitsindicatoren","Nee"]
["Opmerkingen"]
["Zorg Informatie Bouwsteen (ZIB)","ZIB: Verrichting\nContainer (1): \nContainer (2): \nDataelement: VerrichtingType; VerrichtingLateraliteit; VerrichtingStartDatum\nOmzetting naar LROI:"]
["Voorbeeld","<arthrotomyPosterior>1</arthrotomyPosterior>"]
[]
["Terug naar Overzicht"]

{"sheet":"Decompressie ulnaire zenuw (vo)","index":177,"n_rows":23,"n_cols":2,"rows_kept":23,"cut":false,"hidden":false,"merged":[]}
["DATA_ID","LROI421"]
["LROI uitvraag","Decompressie ulnaire zenuw"]
["Variabelenaam XML","decompressionUlnarNerve"]
["Variabelenaam database","ps_ulnar_nerve_decompr"]
["Label EN","Decompression ulnar nerve"]
["Label NL","Decompressie ulnaire zenuw"]
["Definitie","Vrijleggen van de ulnaire zenuw"]
["Doel / reden uitvraag","Inzicht in kwaliteit en historie"]
["Waarde verplicht","Functioneel verplicht "]
["Datatype","Integer (INT)"]
["Domein (acceptabele range, min-max)"]
["Eenheid"]
["Format (max. lengte)"]
["Decimalen"]
["Codering (EN/NL)","0=No/ Nee\n1=Yes/ Ja"]
["Periode","Sinds start registratie"]
["Wijziging (datum en reden)"]
["Noodzakelijk voor kwaliteitsindicatoren","Nee"]
["Opmerkingen"]
["Zorg Informatie Bouwsteen (ZIB)","ZIB: Verrichting\nContainer (1): \nContainer (2): \nDataelement: VerrichtingType; VerrichtingLateraliteit; VerrichtingStartDatum\nOmzetting naar LROI:"]
["Voorbeeld","<decompressionUlnarNerve>1</decompressionUlnarNerve>"]
[]
["Terug naar Overzicht"]

{"sheet":"Transpositie ulnaire zenuw (vo)","index":178,"n_rows":23,"n_cols":2,"rows_kept":23,"cut":false,"hidden":false,"merged":[]}
["DATA_ID","LROI422"]
["LROI uitvraag","Transpositie ulnaire zenuw"]
["Variabelenaam XML","transpositionUlnarNerve"]
["Variabelenaam database","ps_ulnar_nerve_transpos"]
["Label EN","Transpositie ulnar nerve"]
["Label NL","Transpositie ulnaire zenuw"]
["Definitie","Omleggen van ulnaire zenuw"]
["Doel / reden uitvraag","Inzicht in kwaliteit en historie"]
["Waarde verplicht","Functioneel verplicht "]
["Datatype","Integer (INT)"]
["Domein (acceptabele range, min-max)"]
["Eenheid"]
["Format (max. lengte)"]
["Decimalen"]
["Codering (EN/NL)","0=No/ Nee\n1=Yes/ Ja"]
["Periode","Sinds start registratie"]
["Wijziging (datum en reden)"]
["Noodzakelijk voor kwaliteitsindicatoren","Nee"]
["Opmerkingen"]
["Zorg Informatie Bouwsteen (ZIB)","ZIB: Verrichting\nContainer (1): \nContainer (2): \nDataelement: VerrichtingType; VerrichtingLateraliteit; VerrichtingStartDatum\nOmzetting naar LROI:"]
["Voorbeeld","<transpositionUlnarNerve>1</transpositionUlnarNerve>"]
[]
["Terug naar Overzicht"]

{"sheet":"Radiuskopresectie (vo)","index":179,"n_rows":23,"n_cols":2,"rows_kept":23,"cut":false,"hidden":false,"merged":[]}
["DATA_ID","LROI423"]
["LROI uitvraag","Radiuskopresectie"]
["Variabelenaam XML","radialHeadResection"]
["Variabelenaam database","ps_radial_head_resection"]
["Label EN","Radial head resection"]
["Label NL","Radiuskopresectie"]
["Definitie","Chirurgische verwijdering van radiuskop"]
["Doel / reden uitvraag","Inzicht in kwaliteit en historie"]
["Waarde verplicht","Functioneel verplicht "]
["Datatype","Integer (INT)"]
["Domein (acceptabele range, min-max)"]
["Eenheid"]
["Format (max. lengte)"]
["Decimalen"]
["Codering (EN/NL)","0=No/ Nee\n1=Yes/ Ja"]
["Periode","Sinds start registratie"]
["Wijziging (datum en reden)"]
["Noodzakelijk voor kwaliteitsindicatoren","Nee"]
["Opmerkingen"]
["Zorg Informatie Bouwsteen (ZIB)","ZIB: Verrichting\nContainer (1): \nContainer (2): \nDataelement: VerrichtingType; VerrichtingLateraliteit; VerrichtingStartDatum\nOmzetting naar LROI:"]
["Voorbeeld","<radialHeadResection>1</radialHeadResection>"]
[]
["Terug naar Overzicht"]

{"sheet":"Plaat- of schroefverwijdering","index":180,"n_rows":23,"n_cols":2,"rows_kept":23,"cut":false,"hidden":false,"merged":[]}
["DATA_ID",{"$f":"INDEX(Overzicht_unique!$A:$AJ, MATCH($B$2,Overzicht_unique!$A:$A,0), 36)","v":"LROI424"}]
["LROI uitvraag","Plaat- of schroefverwijdering"]
["Variabelenaam XML","plateScrewRemoval"]
["Variabelenaam database","ps_plate_screw_removal"]
["Label EN","Plate or screw removal"]
["Label NL","Plaat- of schroefverwijdering"]
["Definitie","Chirurgische verwijdering van een plaat of schroef uit het ellebooggewricht"]
["Doel / reden uitvraag","Inzicht in kwaliteit en historie"]
["Waarde verplicht","Functioneel verplicht "]
["Datatype","Integer (INT)"]
["Domein (acceptabele range, min-max)"]
["Eenheid"]
["Format (max. lengte)"]
["Decimalen"]
["Codering (EN/NL)","0=No/ Nee\n1=Yes/ Ja"]
["Periode","Sinds start registratie"]
["Wijziging (datum en reden)"]
["Noodzakelijk voor kwaliteitsindicatoren","Nee"]
["Opmerkingen"]
["Zorg Informatie Bouwsteen (ZIB)","ZIB: Verrichting\nContainer (1): \nContainer (2): \nDataelement: VerrichtingType; VerrichtingLateraliteit; VerrichtingStartDatum\nOmzetting naar LROI:"]
["Voorbeeld","<plateScrewRemoval>1</plateScrewRemoval>"]
[]
["Terug naar Overzicht"]

{"sheet":"Osteosynthese radius","index":181,"n_rows":23,"n_cols":2,"rows_kept":23,"cut":false,"hidden":false,"merged":[]}
["DATA_ID",{"$f":"INDEX(Overzicht_unique!$A:$AJ, MATCH($B$2,Overzicht_unique!$A:$A,0), 36)","v":"LROI511"}]
["LROI uitvraag","Osteosynthese radius"]
["Variabelenaam XML","osteosynthesisRadius"]
["Variabelenaam database","ps_orif_dist_radius_fract"]
["Label EN","Osteosynthesis radius"]
["Label NL","Osteosynthese radius"]
["Definitie","Distale radiusfractuur behandeld met open repositie en interne fixatie (ORIF)"]
["Doel / reden uitvraag","Inzicht in kwaliteit en historie"]
["Waarde verplicht","Functioneel verplicht "]
["Datatype","Integer (INT)"]
["Domein (acceptabele range, min-max)"]
["Eenheid"]
["Format (max. lengte)"]
["Decimalen"]
["Codering (EN/NL)","0=No/ Nee\n1=Yes/ Ja"]
["Periode","Sinds start registratie"]
["Wijziging (datum en reden)","Term gewijzigd in LROI-ingrepen v5.1; 01-01-2022. Voorheen \"ORIF distale radiusfractuur\"."]
["Noodzakelijk voor kwaliteitsindicatoren","Nee"]
["Opmerkingen"]
["Zorg Informatie Bouwsteen (ZIB)","ZIB: Verrichting\nContainer (1): \nContainer (2): \nDataelement: VerrichtingType; VerrichtingLateraliteit; VerrichtingStartDatum\nOmzetting naar LROI:"]
["Voorbeeld","<osteosynthesisRadius>1</osteosynthesisRadius>"]
[]
["Terug naar Overzicht"]

{"sheet":"Osteosynthese ulna","index":182,"n_rows":23,"n_cols":2,"rows_kept":23,"cut":false,"hidden":false,"merged":[]}
["DATA_ID",{"$f":"INDEX(Overzicht_unique!$A:$AJ, MATCH($B$2,Overzicht_unique!$A:$A,0), 36)","v":"LROI512"}]
["LROI uitvraag","Osteosynthese ulna"]
["Variabelenaam XML","osteosynthesisUlna"]
["Variabelenaam database","ps_orif_ulna_fracture"]
["Label EN","Osteosynthesis ulna"]
["Label NL","Osteosynthese ulna"]
["Definitie","Ulnafractuur behandeld met open repositie en interne fixatie (ORIF)"]
["Doel / reden uitvraag","Inzicht in kwaliteit en historie"]
["Waarde verplicht","Functioneel verplicht "]
["Datatype","Integer (INT)"]
["Domein (acceptabele range, min-max)"]
["Eenheid"]
["Format (max. lengte)"]
["Decimalen"]
["Codering (EN/NL)","0=No/ Nee\n1=Yes/ Ja"]
["Periode","Sinds LROI-ingrepen v5.1; 01-01-2022"]
["Wijziging (datum en reden)"]
["Noodzakelijk voor kwaliteitsindicatoren","Nee"]
["Opmerkingen"]
["Zorg Informatie Bouwsteen (ZIB)","ZIB: Verrichting\nContainer (1): \nContainer (2): \nDataelement: VerrichtingType; VerrichtingLateraliteit; VerrichtingStartDatum\nOmzetting naar LROI:"]
["Voorbeeld","<osteosynthesisUlna>1</osteosynthesisUlna>"]
[]
["Terug naar Overzicht"]

{"sheet":"Osteosynthese carpus","index":183,"n_rows":23,"n_cols":2,"rows_kept":23,"cut":false,"hidden":false,"merged":[]}
["DATA_ID",{"$f":"INDEX(Overzicht_unique!$A:$AJ, MATCH($B$2,Overzicht_unique!$A:$A,0), 36)","v":"LROI513"}]
["LROI uitvraag","Osteosynthese carpus"]
["Variabelenaam XML","osteosynthesisCarpus"]
["Variabelenaam database","ps_orif_carpals_fracture"]
["Label EN","Osteosynthesis carpus"]
["Label NL","Osteosynthese carpus"]
["Definitie","Carpaalfractuur behandeld met open repositie en interne fixatie (ORIF)"]
["Doel / reden uitvraag","Inzicht in kwaliteit en historie"]
["Waarde verplicht","Functioneel verplicht "]
["Datatype","Integer (INT)"]
["Domein (acceptabele range, min-max)"]
["Eenheid"]
["Format (max. lengte)"]
["Decimalen"]
["Codering (EN/NL)","0=No/ Nee\n1=Yes/ Ja"]
["Periode","Sinds start registratie"]
["Wijziging (datum en reden)","Term gewijzigd in LROI-ingrepen v5.1; 01-01-2022. Voorheen \"ORIF carpaalfractuur\"."]
["Noodzakelijk voor kwaliteitsindicatoren","Nee"]
["Opmerkingen"]
["Zorg Informatie Bouwsteen (ZIB)","ZIB: Verrichting\nContainer (1): \nContainer (2): \nDataelement: VerrichtingType; VerrichtingLateraliteit; VerrichtingStartDatum\nOmzetting naar LROI:"]
["Voorbeeld","<osteosynthesisCarpus>1</osteosynthesisCarpus>"]
[]
["Terug naar Overzicht"]

{"sheet":"Correctie osteotomie radius","index":184,"n_rows":23,"n_cols":2,"rows_kept":23,"cut":false,"hidden":false,"merged":[]}
["DATA_ID",{"$f":"INDEX(Overzicht_unique!$A:$AJ, MATCH($B$2,Overzicht_unique!$A:$A,0), 36)","v":"LROI514"}]
["LROI uitvraag","Correctie osteotomie radius"]
["Variabelenaam XML","correctionOsteotomyRadius"]
["Variabelenaam database","ps_correct_osteo_radius"]
["Label EN","Correction osteotomy radius"]
["Label NL","Correctie osteotomie radius"]
["Definitie","Operatie waarbij het radiusbot doorgezaagd of doorgenomen wordt met als doel om scheefstand van een bot te corrigeren of om belasting op het polsgewricht te veranderen"]
["Doel / reden uitvraag","Inzicht in kwaliteit en historie"]
["Waarde verplicht","Functioneel verplicht "]
["Datatype","Integer (INT)"]
["Domein (acceptabele range, min-max)"]
["Eenheid"]
["Format (max. lengte)"]
["Decimalen"]
["Codering (EN/NL)","0=No/ Nee\n1=Yes/ Ja"]
["Periode","Sinds start registratie"]
["Wijziging (datum en reden)"]
["Noodzakelijk voor kwaliteitsindicatoren","Nee"]
["Opmerkingen"]
["Zorg Informatie Bouwsteen (ZIB)","ZIB: Verrichting\nContainer (1): \nContainer (2): \nDataelement: VerrichtingType; VerrichtingLateraliteit; VerrichtingStartDatum\nOmzetting naar LROI:"]
["Voorbeeld","<correctionOsteotomyRadius>1</correctionOsteotomyRadius>"]
[]
["Terug naar Overzicht"]

{"sheet":"Correction osteotomy ulna","index":185,"n_rows":23,"n_cols":2,"rows_kept":23,"cut":false,"hidden":false,"merged":[]}
["DATA_ID",{"$f":"INDEX(Overzicht_unique!$A:$AJ, MATCH($B$2,Overzicht_unique!$A:$A,0), 36)","v":"LROI515"}]
["LROI uitvraag","Correction osteotomy ulna"]
["Variabelenaam XML","correctionOsteotomyUlna"]
["Variabelenaam database","ps_correct_osteo_ulna"]
["Label EN","Correction osteotomy ulna"]
["Label NL","Correction osteotomy ulna"]
["Definitie","Operatie waarbij het ulnabot doorgezaagd of doorgenomen wordt met als doel om scheefstand van een bot te corrigeren of om belasting op het polsgewricht te veranderen"]
["Doel / reden uitvraag","Inzicht in kwaliteit en historie"]
["Waarde verplicht","Functioneel verplicht "]
["Datatype","Integer (INT)"]
["Domein (acceptabele range, min-max)"]
["Eenheid"]
["Format (max. lengte)"]
["Decimalen"]
["Codering (EN/NL)","0=No/ Nee\n1=Yes/ Ja"]
["Periode","Sinds start registratie"]
["Wijziging (datum en reden)"]
["Noodzakelijk voor kwaliteitsindicatoren","Nee"]
["Opmerkingen"]
["Zorg Informatie Bouwsteen (ZIB)","ZIB: Verrichting\nContainer (1): \nContainer (2): \nDataelement: VerrichtingType; VerrichtingLateraliteit; VerrichtingStartDatum\nOmzetting naar LROI:"]
["Voorbeeld","<correctionOsteotomyUlna>1</correctionOsteotomyUlna>"]
[]
["Terug naar Overzicht"]

{"sheet":"Proximale rij resectie","index":186,"n_rows":23,"n_cols":2,"rows_kept":23,"cut":false,"hidden":false,"merged":[]}
["DATA_ID",{"$f":"INDEX(Overzicht_unique!$A:$AJ, MATCH($B$2,Overzicht_unique!$A:$A,0), 36)","v":"LROI516"}]
["LROI uitvraag","Proximale rij resectie"]
["Variabelenaam XML","proximalRowResectionPrev"]
["Variabelenaam database","ps_prox_row_carpectomy"]
["Label EN","Proximal row resection"]
["Label NL","Proximale rij resectie"]
["Definitie","Operatie waarbij de eerste rij handwortelbeentjes verwijderd worden"]
["Doel / reden uitvraag","Inzicht in kwaliteit en historie"]
["Waarde verplicht","Functioneel verplicht "]
["Datatype","Integer (INT)"]
["Domein (acceptabele range, min-max)"]
["Eenheid"]
["Format (max. lengte)"]
["Decimalen"]
["Codering (EN/NL)","0=No/ Nee\n1=Yes/ Ja"]
["Periode","Sinds start registratie"]
["Wijziging (datum en reden)","Term gewijzigd in LROI-ingrepen v5.1; 01-01-2022. Voorheen \"proximale rij carpectomie\"."]
["Noodzakelijk voor kwaliteitsindicatoren","Nee"]
["Opmerkingen"]
["Zorg Informatie Bouwsteen (ZIB)","ZIB: Verrichting\nContainer (1): \nContainer (2): \nDataelement: VerrichtingType; VerrichtingLateraliteit; VerrichtingStartDatum\nOmzetting naar LROI:"]
["Voorbeeld","<proximalRowResectionPrev>1</proximalRowResectionPrev>"]
[]
["Terug naar Overzicht"]

{"sheet":"Totale artrodese","index":187,"n_rows":23,"n_cols":2,"rows_kept":23,"cut":false,"hidden":false,"merged":[]}
["DATA_ID",{"$f":"INDEX(Overzicht_unique!$A:$AJ, MATCH($B$2,Overzicht_unique!$A:$A,0), 36)","v":"LROI517"}]
["LROI uitvraag","Totale artrodese"]
["Variabelenaam XML","totalArthrodesis"]
["Variabelenaam database","ps_total_arthrodesis"]
["Label EN","Total arthrodesis"]
["Label NL","Totale artrodese"]
["Definitie","Procedure waarbij de bewegelijkheid van het polsgewricht in het geheel is opgeheven door de twee gewrichtsdelen met elkaar te laten vergroeien"]
["Doel / reden uitvraag","Inzicht in kwaliteit en historie"]
["Waarde verplicht","Functioneel verplicht "]
["Datatype","Integer (INT)"]
["Domein (acceptabele range, min-max)"]
["Eenheid"]
["Format (max. lengte)"]
["Decimalen"]
["Codering (EN/NL)","0=No/ Nee\n1=Yes/ Ja"]
["Periode","Sinds start registratie"]
["Wijziging (datum en reden)"]
["Noodzakelijk voor kwaliteitsindicatoren","Nee"]
["Opmerkingen"]
["Zorg Informatie Bouwsteen (ZIB)","ZIB: Verrichting\nContainer (1): \nContainer (2): \nDataelement: VerrichtingType; VerrichtingLateraliteit; VerrichtingStartDatum\nOmzetting naar LROI:"]
["Voorbeeld","<totalArthrodesis>1</totalArthrodesis>"]
[]
["Terug naar Overzicht"]

{"sheet":"Partiële artrodese","index":188,"n_rows":23,"n_cols":2,"rows_kept":23,"cut":false,"hidden":false,"merged":[]}
["DATA_ID",{"$f":"INDEX(Overzicht_unique!$A:$AJ, MATCH($B$2,Overzicht_unique!$A:$A,0), 36)","v":"LROI518"}]
["LROI uitvraag","Partiële artrodese"]
["Variabelenaam XML","partialArthrodesis"]
["Variabelenaam database","ps_part_arthrodesis"]
["Label EN","Partial arthrodesis"]
["Label NL","Partiële artrodese"]
["Definitie","Procedure waarbij de bewegelijkheid van het polsgewricht gedeeltelijk is opgeheven door de twee gewrichtsdelen met elkaar te laten vergroeien"]
["Doel / reden uitvraag","Inzicht in kwaliteit en historie"]
["Waarde verplicht","Functioneel verplicht "]
["Datatype","Integer (INT)"]
["Domein (acceptabele range, min-max)"]
["Eenheid"]
["Format (max. lengte)"]
["Decimalen"]
["Codering (EN/NL)","0=No/ Nee\n1=Yes/ Ja"]
["Periode","Sinds start registratie"]
["Wijziging (datum en reden)"]
["Noodzakelijk voor kwaliteitsindicatoren","Nee"]
["Opmerkingen"]
["Zorg Informatie Bouwsteen (ZIB)","ZIB: Verrichting\nContainer (1): \nContainer (2): \nDataelement: VerrichtingType; VerrichtingLateraliteit; VerrichtingStartDatum\nOmzetting naar LROI:"]
["Voorbeeld","<partialArthrodesis>1</partialArthrodesis>"]
[]
["Terug naar Overzicht"]

{"sheet":"Sauvé-Kapandji","index":189,"n_rows":23,"n_cols":2,"rows_kept":23,"cut":false,"hidden":false,"merged":[]}
["DATA_ID",{"$f":"INDEX(Overzicht_unique!$A:$AJ, MATCH($B$2,Overzicht_unique!$A:$A,0), 36)","v":"LROI519"}]
["LROI uitvraag","Sauvé-Kapandji"]
["Variabelenaam XML","sauveKapanji"]
["Variabelenaam database","ps_sauve_kap_procedure"]
["Label EN","Sauve-Kapanji"]
["Label NL","Sauvé-Kapandji"]
["Definitie","Procedure waarbij de pols (distale radio-ulnaire gewricht) wordt gefixeerd en resectie-osteotomie van de distale ulna wordt verricht"]
["Doel / reden uitvraag","Inzicht in kwaliteit en historie"]
["Waarde verplicht","Functioneel verplicht "]
["Datatype","Integer (INT)"]
["Domein (acceptabele range, min-max)"]
["Eenheid"]
["Format (max. lengte)"]
["Decimalen"]
["Codering (EN/NL)","0=No/ Nee\n1=Yes/ Ja"]
["Periode","Sinds start registratie"]
["Wijziging (datum en reden)","Term gewijzigd in LROI-ingrepen v5.1; 01-01-2022. Voorheen \"Sauvé-Kapandji procedure\"."]
["Noodzakelijk voor kwaliteitsindicatoren","Nee"]
["Opmerkingen"]
["Zorg Informatie Bouwsteen (ZIB)","ZIB: Verrichting\nContainer (1): \nContainer (2): \nDataelement: VerrichtingType; VerrichtingLateraliteit; VerrichtingStartDatum\nOmzetting naar LROI:"]
["Voorbeeld","<sauveKapanji>1</sauveKapanji>"]
[]
["Terug naar Overzicht"]

{"sheet":"Ligamentaire reconstructie","index":190,"n_rows":23,"n_cols":2,"rows_kept":23,"cut":false,"hidden":false,"merged":[]}
["DATA_ID",{"$f":"INDEX(Overzicht_unique!$A:$AJ, MATCH($B$2,Overzicht_unique!$A:$A,0), 36)","v":"LROI520"}]
["LROI uitvraag","Ligamentaire reconstructie"]
["Variabelenaam XML","ligamentaryReconstruction"]
["Variabelenaam database","Ps_intercarp_stabil (pols); ps_ligament_reconstr (vinger)"]
["Label EN","Ligamentary reconstruction"]
["Label NL","Ligamentaire reconstructie"]
["Definitie","Reconstructie van het pols/vingerligament"]
["Doel / reden uitvraag","Inzicht in kwaliteit en historie"]
["Waarde verplicht","Functioneel verplicht "]
["Datatype","Integer (INT)"]
["Domein (acceptabele range, min-max)"]
["Eenheid"]
["Format (max. lengte)"]
["Decimalen"]
["Codering (EN/NL)","0=No/ Nee\n1=Yes/ Ja"]
["Periode","Sinds start registratie"]
["Wijziging (datum en reden)","Term gewijzigd in LROI-ingrepen v5.1; 01-01-2022. Voorheen \"intercarpale stabilisatie/ligament reconstructie\"."]
["Noodzakelijk voor kwaliteitsindicatoren","Nee"]
["Opmerkingen"]
["Zorg Informatie Bouwsteen (ZIB)","ZIB: Verrichting\nContainer (1): \nContainer (2): \nDataelement: VerrichtingType; VerrichtingLateraliteit; VerrichtingStartDatum\nOmzetting naar LROI:"]
["Voorbeeld","<ligamentaryReconstruction>1</ligamentaryReconstruction>"]
[]
["Terug naar Overzicht"]

{"sheet":"Interpositie plastiek","index":191,"n_rows":23,"n_cols":2,"rows_kept":23,"cut":false,"hidden":false,"merged":[]}
["DATA_ID",{"$f":"INDEX(Overzicht_unique!$A:$AJ, MATCH($B$2,Overzicht_unique!$A:$A,0), 36)","v":"LROI600"}]
["LROI uitvraag","Interpositie plastiek"]
["Variabelenaam XML","interpositionArthroplasty"]
["Variabelenaam database","ps_interpos_arthropl"]
["Label EN","Interposition arthroplasty"]
["Label NL","Interpositie plastiek"]
["Definitie","Autoloog weefsel (spier, vet of huid) van de patiënt inbrengen tussen de aangedane gewrichtsvlakken"]
["Doel / reden uitvraag","Inzicht in kwaliteit en historie"]
["Waarde verplicht","Functioneel verplicht "]
["Datatype","Integer (INT)"]
["Domein (acceptabele range, min-max)"]
["Eenheid"]
["Format (max. lengte)"]
["Decimalen"]
["Codering (EN/NL)","0=No/ Nee\n1=Yes/ Ja"]
["Periode","Sinds start registratie"]
["Wijziging (datum en reden)","Term gewijzigd in LROI-ingrepen v5.1; 01-01-2022. Voorheen \"interpositie artroplastiek\"."]
["Noodzakelijk voor kwaliteitsindicatoren","Nee"]
["Opmerkingen"]
["Zorg Informatie Bouwsteen (ZIB)","ZIB: Verrichting\nContainer (1): \nContainer (2): \nDataelement: VerrichtingType; VerrichtingLateraliteit; VerrichtingStartDatum\nOmzetting naar LROI:"]
["Voorbeeld","<interpositionArthroplasty>1</interpositionArthroplasty>"]
[]
["Terug naar Overzicht"]

{"sheet":"Osteosynth intra-articul fract","index":192,"n_rows":23,"n_cols":2,"rows_kept":23,"cut":false,"hidden":false,"merged":[]}
["DATA_ID",{"$f":"INDEX(Overzicht_unique!$A:$AJ, MATCH($B$2,Overzicht_unique!$A:$A,0), 36)","v":"LROI601"}]
["LROI uitvraag","Osteosynthese intra-articulaire fractuur"]
["Variabelenaam XML","osteosynthesisIntraArticularFracture"]
["Variabelenaam database","ps_osteo_intra_artic_frac"]
["Label EN","Osteosynthesis intra-articular fracture"]
["Label NL","Osteosynthese intra-articulaire fractuur"]
["Definitie","Repositie en fixatie van fracturen of pseudoartrose met behulp van (een combinatie van) metalen platen, pennen en/of schroeven"]
["Doel / reden uitvraag","Inzicht in kwaliteit en historie"]
["Waarde verplicht","Functioneel verplicht "]
["Datatype","Integer (INT)"]
["Domein (acceptabele range, min-max)"]
["Eenheid"]
["Format (max. lengte)"]
["Decimalen"]
["Codering (EN/NL)","0=No/ Nee\n1=Yes/ Ja"]
["Periode","Sinds start registratie"]
["Wijziging (datum en reden)"]
["Noodzakelijk voor kwaliteitsindicatoren","Nee"]
["Opmerkingen"]
["Zorg Informatie Bouwsteen (ZIB)","ZIB: Verrichting\nContainer (1): \nContainer (2): \nDataelement: VerrichtingType; VerrichtingLateraliteit; VerrichtingStartDatum\nOmzetting naar LROI:"]
["Voorbeeld","<osteosynthesisIntraArticularFracture>1</osteosynthesisIntraArticularFracture>"]
[]
["Terug naar Overzicht"]

{"sheet":"Plaatsing spacer","index":193,"n_rows":23,"n_cols":2,"rows_kept":23,"cut":false,"hidden":false,"merged":[]}
["DATA_ID",{"$f":"INDEX(Overzicht_unique!$A:$AJ, MATCH($B$2,Overzicht_unique!$A:$A,0), 36)","v":"LROI602"}]
["LROI uitvraag","Plaatsing spacer"]
["Variabelenaam XML","placementSpacer"]
["Variabelenaam database","ps_interpos_spacer"]
["Label EN","Placement spacer"]
["Label NL","Plaatsing spacer"]
["Definitie","Vreemd lichaam inbrengen tussen de aangedane gewrichtsvlakken"]
["Doel / reden uitvraag","Inzicht in kwaliteit en historie"]
["Waarde verplicht","Functioneel verplicht "]
["Datatype","Integer (INT)"]
["Domein (acceptabele range, min-max)"]
["Eenheid"]
["Format (max. lengte)"]
["Decimalen"]
["Codering (EN/NL)","0=No/ Nee\n1=Yes/ Ja"]
["Periode","Sinds start registratie"]
["Wijziging (datum en reden)","Term gewijzigd in LROI-ingrepen v5.1; 01-01-2022. Voorheen \"interpositie spacer\"."]
["Noodzakelijk voor kwaliteitsindicatoren","Nee"]
["Opmerkingen"]
["Zorg Informatie Bouwsteen (ZIB)","ZIB: Verrichting\nContainer (1): \nContainer (2): \nDataelement: VerrichtingType; VerrichtingLateraliteit; VerrichtingStartDatum\nOmzetting naar LROI:"]
["Voorbeeld","<placementSpacer>1</placementSpacer>"]
[]
["Terug naar Overzicht"]

{"sheet":"Andere voorgaande operaties","index":194,"n_rows":23,"n_cols":2,"rows_kept":23,"cut":false,"hidden":false,"merged":[]}
["DATA_ID",{"$f":"INDEX(Overzicht_unique!$A:$AJ, MATCH($B$2,Overzicht_unique!$A:$A,0), 36)","v":"LROI061, LROI164, LROI254, LROI336, LROI425, LROI521, LROI603"}]
["LROI uitvraag","Andere voorgaande operaties"]
["Variabelenaam XML","previousOperationsOther"]
["Variabelenaam database","ps_other"]
["Label EN","Other Previous Operations"]
["Label NL","Andere voorgaande operaties"]
["Definitie","Andere voorgaande operaties"]
["Doel / reden uitvraag","Voorgaande operaties anders dan keuzemogelijkheden "]
["Waarde verplicht","Functioneel verplicht "]
["Datatype","Integer (INT)"]
["Domein (acceptabele range, min-max)"]
["Eenheid"]
["Format (max. lengte)"]
["Decimalen"]
["Codering (EN/NL)","0=No/ Nee\n1=Yes/ Ja"]
["Periode","Sinds start registratie"]
["Wijziging (datum en reden)"]
["Noodzakelijk voor kwaliteitsindicatoren","Nee"]
["Opmerkingen"]
["Zorg Informatie Bouwsteen (ZIB)","ZIB: Verrichting\nContainer (1): \nContainer (2): \nDataelement: VerrichtingType; VerrichtingLateraliteit; VerrichtingStartDatum\nOmzetting naar LROI:"]
["Voorbeeld","<previousOperationsOtherr>1</previousOperationsOther>"]
[]
["Terug naar Overzicht"]

{"sheet":"Andere vg operaties, spec","index":195,"n_rows":23,"n_cols":2,"rows_kept":23,"cut":false,"hidden":false,"merged":[]}
["DATA_ID",{"$f":"INDEX(Overzicht_unique!$A:$AJ, MATCH($B$2,Overzicht_unique!$A:$A,0), 36)","v":"LROI062, LROI165, LROI255, LROI337, LROI426, LROI522, LROI604"}]
["LROI uitvraag","Andere voorgaande operaties, specificeer"]
["Variabelenaam XML","previousOperationsSpecify"]
["Variabelenaam database","ps_other_spec"]
["Label EN","Other previous operations, specify"]
["Label NL","Andere voorgaande operaties, specificeer"]
["Definitie","Voorgaande operatie, anders dan keuzemogelijkheden"]
["Doel / reden uitvraag","Inzicht in kwaliteit; Leren en verbeteren; inzicht in voorgaande operaties die niet tot de keuzemogelijkheden behoren "]
["Waarde verplicht","Functioneel verplicht wanneer er ‘Andere voorgaande operaties’ geregistreerd is"]
["Datatype","Tekst (TXT)"]
["Domein (acceptabele range, min-max)"]
["Eenheid"]
["Format (max. lengte)",40]
["Decimalen"]
["Codering (EN/NL)","0=No/ Nee\n1=Yes/ Ja"]
["Periode","Sinds start registratie"]
["Wijziging (datum en reden)"]
["Noodzakelijk voor kwaliteitsindicatoren","Nee"]
["Opmerkingen","Specificeerveld in tekst"]
["Zorg Informatie Bouwsteen (ZIB)","ZIB: Verrichting\nContainer (1): \nContainer (2): \nDataelement: VerrichtingType; VerrichtingLateraliteit; VerrichtingStartDatum\nOmzetting naar LROI:"]
["Voorbeeld","<previousOperationsOther>1</previousOperationsOther>"]
[]
["Terug naar Overzicht"]

{"sheet":"Fixatie","index":196,"n_rows":23,"n_cols":2,"rows_kept":23,"cut":false,"hidden":false,"merged":[]}
["DATA_ID",{"$f":"INDEX(Overzicht_unique!$A:$AJ, MATCH($B$2,Overzicht_unique!$A:$A,0), 36)","v":"LROI064, LROI166, LROI256, LROI338, LROI427, LROI523, LROI605"}]
["LROI uitvraag","Fixatie"]
["Variabelenaam XML","fixation"]
["Variabelenaam database","fixation(_basic)"]
["Label EN","Fixation"]
["Label NL","Fixatie"]
["Definitie","Fixatie van de prothese; gecementeerd, ongecementeerd of hybride (waarbij het ene component(en) gecementeerd wordt en het andere(n) ongecementeerd)"]
["Doel / reden uitvraag","Inzicht in kwaliteit; operatiemethode"]
["Waarde verplicht","Functioneel verplicht "]
["Datatype","Integer (INT)"]
["Domein (acceptabele range, min-max)"]
["Eenheid"]
["Format (max. lengte)"]
["Decimalen"]
["Codering (EN/NL)","Heup, knie, schouder, elleboog, pols, vinger:\n0=Cementless/Ongecementeerd\n1=Hybrid/Hybride\n2=Cemented/Gecementeerd\nEnkel:\n0=Cementless/Ongecementeerd\n1=Cemented/Gecementeerd"]
["Periode","Sinds start registratie"]
["Wijziging (datum en reden)"]
["Noodzakelijk voor kwaliteitsindicatoren","Nee"]
["Opmerkingen"]
["Zorg Informatie Bouwsteen (ZIB)","ZIB: Verrichting\nContainer (1): \nContainer (2): \nDataelement: VerrichtingMethode\nOmzetting naar LROI:"]
["Voorbeeld","<fixation>1</fixation>"]
[]
["Terug naar Overzicht"]

{"sheet":"Lavage","index":197,"n_rows":23,"n_cols":2,"rows_kept":23,"cut":false,"hidden":false,"merged":[]}
["DATA_ID",{"$f":"INDEX(Overzicht_unique!$A:$AJ, MATCH($B$2,Overzicht_unique!$A:$A,0), 36)","v":"LROI065, LROI167, LROI257, LROI339, LROI428, LROI524"}]
["LROI uitvraag","Lavage"]
["Variabelenaam XML","lavage"]
["Variabelenaam database","cement_lavage"]
["Label EN","Lavage"]
["Label NL","Lavage"]
["Definitie","Het spoelen van het gewricht om bloed, vloeistoffen en andere resten te verwijderen"]
["Doel / reden uitvraag","Inzicht in kwaliteit; operatiemethode"]
["Waarde verplicht","Functioneel verplicht "]
["Datatype","Integer (INT)"]
["Domein (acceptabele range, min-max)"]
["Eenheid"]
["Format (max. lengte)"]
["Decimalen"]
["Codering (EN/NL)","0=No/ Nee\n1=Yes/ Ja"]
["Periode","Sinds start registratie; Toegevoegd voor polsgewricht in LROI-ingrepen v5.1; 01-01-2022"]
["Wijziging (datum en reden)"]
["Noodzakelijk voor kwaliteitsindicatoren","Nee"]
["Opmerkingen"]
["Zorg Informatie Bouwsteen (ZIB)","ZIB: Verrichting\nContainer (1): \nContainer (2): \nDataelement: VerrichtingType; VerrichtingStartDatum\nOmzetting naar LROI:"]
["Voorbeeld","<lavage>1</lavage>"]
[]
["Terug naar Overzicht"]

{"sheet":"Vacuum mix","index":198,"n_rows":23,"n_cols":2,"rows_kept":23,"cut":false,"hidden":false,"merged":[]}
["DATA_ID",{"$f":"INDEX(Overzicht_unique!$A:$AJ, MATCH($B$2,Overzicht_unique!$A:$A,0), 36)","v":"LROI066, LROI168, LROI340, LROI429, LROI525"}]
["LROI uitvraag","Vacuum (mix)"]
["Variabelenaam XML","vacuumMix"]
["Variabelenaam database","cement_vacuum_system"]
["Label EN","Vacuum (mix)"]
["Label NL","Vacuum (mix)"]
["Definitie","Het gebruik van een vacuumsysteem voor het klaarmaken van botcement"]
["Doel / reden uitvraag","Inzicht in kwaliteit; operatiemethode"]
["Waarde verplicht","Functioneel verplicht "]
["Datatype","Integer (INT)"]
["Domein (acceptabele range, min-max)"]
["Eenheid"]
["Format (max. lengte)"]
["Decimalen"]
["Codering (EN/NL)","0=No/ Nee\n1=Yes/ Ja"]
["Periode","Sinds start registratie; Toegevoegd voor polsgewricht in LROI-ingrepen v5.1; 01-01-2022"]
["Wijziging (datum en reden)"]
["Noodzakelijk voor kwaliteitsindicatoren","Nee"]
["Opmerkingen"]
["Zorg Informatie Bouwsteen (ZIB)","ZIB: Verrichting\nContainer (1): \nContainer (2): \nDataelement: Producttype; VerrichtingType; VerrichtingStartDatum\nOmzetting naar LROI:"]
["Voorbeeld","<vacuumMix>1</vacuumMix>"]
[]
["Terug naar Overzicht"]

{"sheet":"Pressurising","index":199,"n_rows":23,"n_cols":2,"rows_kept":23,"cut":false,"hidden":false,"merged":[]}
["DATA_ID",{"$f":"INDEX(Overzicht_unique!$A:$AJ, MATCH($B$2,Overzicht_unique!$A:$A,0), 36)","v":"LROI067, LROI169, LROI341, LROI430, LROI526"}]
["LROI uitvraag","Pressurising"]
["Variabelenaam XML","pressurising"]
["Variabelenaam database","cement_pressurizing"]
["Label EN","Pressurising"]
["Label NL","Pressurising"]
["Definitie","Het gebruik van een cementplug en retrograde injectie van cement"]
["Doel / reden uitvraag","Inzicht in kwaliteit; operatiemethode"]
["Waarde verplicht","Functioneel verplicht "]
["Datatype","Integer (INT)"]
["Domein (acceptabele range, min-max)"]
["Eenheid"]
["Format (max. lengte)"]
["Decimalen"]
["Codering (EN/NL)","0=No/ Nee\n1=Yes/ Ja"]
["Periode","Sinds start registratie; Toegevoegd voor polsgewricht in LROI-ingrepen v5.1; 01-01-2022"]
["Wijziging (datum en reden)"]
["Noodzakelijk voor kwaliteitsindicatoren","Nee"]
["Opmerkingen"]
["Zorg Informatie Bouwsteen (ZIB)","ZIB: Verrichting\nContainer (1): \nContainer (2): \nDataelement: VerrichtingMethode; VerrichtingType; VerrichtingStartDatum\nOmzetting naar LROI:"]
["Voorbeeld","<pressurising>1</pressurising>"]
[]
["Terug naar Overzicht"]

{"sheet":"Acetabulumcomponent gecem","index":200,"n_rows":23,"n_cols":2,"rows_kept":23,"cut":false,"hidden":false,"merged":[]}
["DATA_ID",{"$f":"INDEX(Overzicht_unique!$A:$AJ, MATCH($B$2,Overzicht_unique!$A:$A,0), 36)","v":"LROI068"}]
["LROI uitvraag","Acetabulumcomponent gecementeerd"]
["Variabelenaam XML","acetabulumCemented"]
["Variabelenaam database","cemented_acatabulum"]
["Label EN","Acetabular component cemented"]
["Label NL","Acetabulumcomponent gecementeerd"]
["Definitie","Indien hybride fixatie, acetabulumcomponent gecementeerd"]
["Doel / reden uitvraag","Inzicht in kwaliteit; operatiemethode"]
["Waarde verplicht","Functioneel verplicht indien hybride fixatie"]
["Datatype","Integer (INT)"]
["Domein (acceptabele range, min-max)"]
["Eenheid"]
["Format (max. lengte)"]
["Decimalen"]
["Codering (EN/NL)","0=No/ Nee\n1=Yes/ Ja"]
["Periode","Sinds start registratie"]
["Wijziging (datum en reden)"]
["Noodzakelijk voor kwaliteitsindicatoren","Nee"]
["Opmerkingen"]
["Zorg Informatie Bouwsteen (ZIB)","ZIB: Verrichting\nContainer (1): \nContainer (2): \nDataelement: ProductType; VerrichtingType; VerrichtingStartDatum\nOmzetting naar LROI:"]
["Voorbeeld","<acetabulumCemented>1</acetabulumCemented>"]
[]
["Terug naar Overzicht"]

{"sheet":"Femurcomponent gecementeerd","index":201,"n_rows":23,"n_cols":2,"rows_kept":23,"cut":false,"hidden":false,"merged":[]}
["DATA_ID",{"$f":"INDEX(Overzicht_unique!$A:$AJ, MATCH($B$2,Overzicht_unique!$A:$A,0), 36)","v":"LROI069, LROI170"}]
["LROI uitvraag","Femurcomponent gecementeerd"]
["Variabelenaam XML","femurCemented"]
["Variabelenaam database","cemented_femur"]
["Label EN","Femoral component cemented"]
["Label NL","Femurcomponent gecementeerd"]
["Definitie","Indien hybride fixatie, femurcomponent gecementeerd"]
["Doel / reden uitvraag","Inzicht in kwaliteit; operatiemethode"]
["Waarde verplicht","Functioneel verplicht indien hybride fixatie"]
["Datatype","Integer (INT)"]
["Domein (acceptabele range, min-max)"]
["Eenheid"]
["Format (max. lengte)"]
["Decimalen"]
["Codering (EN/NL)","0=No/ Nee\n1=Yes/ Ja"]
["Periode","Sinds start registratie"]
["Wijziging (datum en reden)"]
["Noodzakelijk voor kwaliteitsindicatoren","Nee"]
["Opmerkingen"]
["Zorg Informatie Bouwsteen (ZIB)","ZIB: Verrichting\nContainer (1): \nContainer (2): \nDataelement: ProductType; VerrichtingType; VerrichtingStartDatum\nOmzetting naar LROI:"]
["Voorbeeld","<femurCemented>1</femurCemented>"]
[]
["Terug naar Overzicht"]

{"sheet":"Cement-in-cement","index":202,"n_rows":23,"n_cols":2,"rows_kept":23,"cut":false,"hidden":false,"merged":[]}
["DATA_ID",{"$f":"INDEX(Overzicht_unique!$A:$AJ, MATCH($B$2,Overzicht_unique!$A:$A,0), 36)","v":"LROI063"}]
["LROI uitvraag","Cement-in-cement"]
["Variabelenaam XML","cementInCement"]
["Variabelenaam database","cemented_in_cemented"]
["Label EN","Cement-in-cement"]
["Label NL","Cement-in-cement"]
["Definitie","Het verwijderen van de oude prothese met (grotendeels) in situ laten van de oude cementmantel, en vervolgens opnieuw cementeren van een prothese (cup en/of steel) "]
["Doel / reden uitvraag","Inzicht in kwaliteit; operatiemethode"]
["Waarde verplicht","Functioneel verplicht "]
["Datatype","Integer (INT)"]
["Domein (acceptabele range, min-max)"]
["Eenheid"]
["Format (max. lengte)"]
["Decimalen"]
["Codering (EN/NL)","0=No/ Nee\n1=Yes/ Ja"]
["Periode","Sinds LROI-ingrepen v5.1; 01-01-2022"]
["Wijziging (datum en reden)"]
["Noodzakelijk voor kwaliteitsindicatoren","Nee"]
["Opmerkingen"]
["Zorg Informatie Bouwsteen (ZIB)","ZIB:\nContainer (1): \nContainer (2): \nDataelement:\nOmzetting naar LROI:"]
["Voorbeeld","<cementInCement>1</cementInCement>"]
[]
["Terug naar Overzicht"]

{"sheet":"Tibiacomponent gecementeerd","index":203,"n_rows":23,"n_cols":2,"rows_kept":23,"cut":false,"hidden":false,"merged":[]}
["DATA_ID",{"$f":"INDEX(Overzicht_unique!$A:$AJ, MATCH($B$2,Overzicht_unique!$A:$A,0), 36)","v":"LROI171"}]
["LROI uitvraag","Tibiacomponent gecementeerd"]
["Variabelenaam XML","tibiaCemented"]
["Variabelenaam database","cemented_tibia"]
["Label EN","Tibial component cemented"]
["Label NL","Tibiacomponent gecementeerd"]
["Definitie","Indien hybride fixatie, tibiacomponent gecementeerd"]
["Doel / reden uitvraag","Inzicht in kwaliteit; operatiemethode"]
["Waarde verplicht","Functioneel verplicht indien hybride fixatie"]
["Datatype","Integer (INT)"]
["Domein (acceptabele range, min-max)"]
["Eenheid"]
["Format (max. lengte)"]
["Decimalen"]
["Codering (EN/NL)","0=No/ Nee\n1=Yes/ Ja"]
["Periode","Sinds start registratie"]
["Wijziging (datum en reden)"]
["Noodzakelijk voor kwaliteitsindicatoren","Nee"]
["Opmerkingen"]
["Zorg Informatie Bouwsteen (ZIB)","ZIB: Verrichting\nContainer (1): MedischHulpmiddel::MedischHulpmiddel\nContainer (2): Product\nDataelement: ProductType\nOmzetting naar LROI:"]
["Voorbeeld","<tibiaCemented>1</tibiaCemented>"]
[]
["Terug naar Overzicht"]

{"sheet":"Patellacomponent gecementeerd","index":204,"n_rows":23,"n_cols":2,"rows_kept":23,"cut":false,"hidden":false,"merged":[]}
["DATA_ID",{"$f":"INDEX(Overzicht_unique!$A:$AJ, MATCH($B$2,Overzicht_unique!$A:$A,0), 36)","v":"LROI172"}]
["LROI uitvraag","Patellacomponent gecementeerd"]
["Variabelenaam XML","patellaCemented"]
["Variabelenaam database","cemented_patella"]
["Label EN","Patellar component cemented"]
["Label NL","Patellacomponent gecementeerd"]
["Definitie","Indien hybride fixatie, patellacomponent gecementeerd"]
["Doel / reden uitvraag","Inzicht in kwaliteit; operatiemethode"]
["Waarde verplicht","Functioneel verplicht indien hybride fixatie"]
["Datatype","Integer (INT)"]
["Domein (acceptabele range, min-max)"]
["Eenheid"]
["Format (max. lengte)"]
["Decimalen"]
["Codering (EN/NL)","0=No/ Nee\n1=Yes/ Ja"]
["Periode","Sinds start registratie"]
["Wijziging (datum en reden)"]
["Noodzakelijk voor kwaliteitsindicatoren","Nee"]
["Opmerkingen"]
["Zorg Informatie Bouwsteen (ZIB)","ZIB: Verrichting\nContainer (1): MedischHulpmiddel::MedischHulpmiddel\nContainer (2): Product\nDataelement: ProductType\nOmzetting naar LROI:"]
["Voorbeeld","<patellaCemented>1</patellaCemented>"]
[]
["Terug naar Overzicht"]

{"sheet":"Humeruscomponent gecementeerd","index":205,"n_rows":23,"n_cols":2,"rows_kept":23,"cut":false,"hidden":false,"merged":[]}
["DATA_ID",{"$f":"INDEX(Overzicht_unique!$A:$AJ, MATCH($B$2,Overzicht_unique!$A:$A,0), 36)","v":"LROI342, LROI431"}]
["LROI uitvraag","Humeruscomponent gecementeerd"]
["Variabelenaam XML","humerusCemented"]
["Variabelenaam database","cemented_humeralstem (schouder); cemented_humerus (elleboog)"]
["Label EN","Humeral component cemented"]
["Label NL","Humeruscomponent gecementeerd"]
["Definitie","Indien hybride fixatie, humeruscomponent gecementeerd"]
["Doel / reden uitvraag","Inzicht in kwaliteit; operatiemethode"]
["Waarde verplicht","Functioneel verplicht indien hybride fixatie"]
["Datatype","Integer (INT)"]
["Domein (acceptabele range, min-max)"]
["Eenheid"]
["Format (max. lengte)"]
["Decimalen"]
["Codering (EN/NL)","0=No/ Nee\n1=Yes/ Ja"]
["Periode","Sinds start registratie"]
["Wijziging (datum en reden)"]
["Noodzakelijk voor kwaliteitsindicatoren","Nee"]
["Opmerkingen"]
["Zorg Informatie Bouwsteen (ZIB)","ZIB: Verrichting\nContainer (1): MedischHulpmiddel::MedischHulpmiddel\nContainer (2): Product\nDataelement: ProductType\nOmzetting naar LROI:"]
["Voorbeeld","<humerusCemented>1</humerusCemented>"]
[]
["Terug naar Overzicht"]

{"sheet":"Glenoïdcomponent gecementeerd","index":206,"n_rows":23,"n_cols":2,"rows_kept":23,"cut":false,"hidden":false,"merged":[]}
["DATA_ID",{"$f":"INDEX(Overzicht_unique!$A:$AJ, MATCH($B$2,Overzicht_unique!$A:$A,0), 36)","v":"LROI343"}]
["LROI uitvraag","Glenoïdcomponent gecementeerd"]
["Variabelenaam XML","glenoidCemented"]
["Variabelenaam database","cemented_glen"]
["Label EN","Glenoid component cemented"]
["Label NL","Glenoïdcomponent gecementeerd"]
["Definitie","Indien hybride fixatie, glenoïdcomponent gecementeerd"]
["Doel / reden uitvraag","Inzicht in kwaliteit; operatiemethode"]
["Waarde verplicht","Functioneel verplicht indien hybride fixatie"]
["Datatype","Integer (INT)"]
["Domein (acceptabele range, min-max)"]
["Eenheid"]
["Format (max. lengte)"]
["Decimalen"]
["Codering (EN/NL)","0=No/ Nee\n1=Yes/ Ja"]
["Periode","Sinds start registratie"]
["Wijziging (datum en reden)"]
["Noodzakelijk voor kwaliteitsindicatoren","Nee"]
["Opmerkingen"]
["Zorg Informatie Bouwsteen (ZIB)","ZIB: Verrichting\nContainer (1): MedischHulpmiddel::MedischHulpmiddel\nContainer (2): Product\nDataelement: ProductType\nOmzetting naar LROI:"]
["Voorbeeld","<glenoidCemented>1</glenoidCemented>"]
[]
["Terug naar Overzicht"]

{"sheet":"Ulnacomponent gecementeerd","index":207,"n_rows":23,"n_cols":2,"rows_kept":23,"cut":false,"hidden":false,"merged":[]}
["DATA_ID",{"$f":"INDEX(Overzicht_unique!$A:$AJ, MATCH($B$2,Overzicht_unique!$A:$A,0), 36)","v":"LROI432, LROI528"}]
["LROI uitvraag","Ulnacomponent gecementeerd"]
["Variabelenaam XML","ulnaCemented"]
["Variabelenaam database","cemented_ulna"]
["Label EN","Ulnar component cemented"]
["Label NL","Ulnacomponent gecementeerd"]
["Definitie","Indien hybride fixatie, ulnacomponent gecementeerd"]
["Doel / reden uitvraag","Inzicht in kwaliteit; operatiemethode"]
["Waarde verplicht","Functioneel verplicht indien hybride fixatie"]
["Datatype","Integer (INT)"]
["Domein (acceptabele range, min-max)"]
["Eenheid"]
["Format (max. lengte)"]
["Decimalen"]
["Codering (EN/NL)","0=No/ Nee\n1=Yes/ Ja"]
["Periode","Sinds start registratie"]
["Wijziging (datum en reden)"]
["Noodzakelijk voor kwaliteitsindicatoren","Nee"]
["Opmerkingen"]
["Zorg Informatie Bouwsteen (ZIB)","ZIB: Verrichting\nContainer (1): MedischHulpmiddel::MedischHulpmiddel\nContainer (2): Product\nDataelement: ProductType\nOmzetting naar LROI:"]
["Voorbeeld","<ulnaCemented>1</ulnaCemented>"]
[]
["Terug naar Overzicht"]

{"sheet":"Radiuscomponent gecementeerd","index":208,"n_rows":23,"n_cols":2,"rows_kept":23,"cut":false,"hidden":false,"merged":[]}
["DATA_ID",{"$f":"INDEX(Overzicht_unique!$A:$AJ, MATCH($B$2,Overzicht_unique!$A:$A,0), 36)","v":"LROI433, LROI527"}]
["LROI uitvraag","Radiuscomponent gecementeerd"]
["Variabelenaam XML","radiusCemented"]
["Variabelenaam database","cemented_radialhead"]
["Label EN","Radial component cemented"]
["Label NL","Radiuscomponent gecementeerd"]
["Definitie","Indien hybride fixatie, radiuscomponent gecementeerd"]
["Doel / reden uitvraag","Inzicht in kwaliteit; operatiemethode"]
["Waarde verplicht","Functioneel verplicht indien hybride fixatie"]
["Datatype","Integer (INT)"]
["Domein (acceptabele range, min-max)"]
["Eenheid"]
["Format (max. lengte)"]
["Decimalen"]
["Codering (EN/NL)","0=No/ Nee\n1=Yes/ Ja"]
["Periode","Sinds start registratie"]
["Wijziging (datum en reden)"]
["Noodzakelijk voor kwaliteitsindicatoren","Nee"]
["Opmerkingen"]
["Zorg Informatie Bouwsteen (ZIB)","ZIB: Verrichting\nContainer (1): MedischHulpmiddel::MedischHulpmiddel\nContainer (2): Product\nDataelement: ProductType\nOmzetting naar LROI:"]
["Voorbeeld","<radiusCemented>1</radiusCemented>"]
[]
["Terug naar Overzicht"]

{"sheet":"Carpaalcomponent gecementeerd","index":209,"n_rows":23,"n_cols":2,"rows_kept":23,"cut":false,"hidden":false,"merged":[]}
["DATA_ID",{"$f":"INDEX(Overzicht_unique!$A:$AJ, MATCH($B$2,Overzicht_unique!$A:$A,0), 36)","v":"LROI529"}]
["LROI uitvraag","Carpaalcomponent gecementeerd"]
["Variabelenaam XML","carpalCemented"]
["Variabelenaam database","cemented_carpals"]
["Label EN","Carpal component cemented"]
["Label NL","Carpaalcomponent gecementeerd"]
["Definitie","Indien hybride fixatie, carpaalcomponent gecementeerd"]
["Doel / reden uitvraag","Inzicht in kwaliteit; operatiemethode"]
["Waarde verplicht","Functioneel verplicht indien hybride fixatie"]
["Datatype","Integer (INT)"]
["Domein (acceptabele range, min-max)"]
["Eenheid"]
["Format (max. lengte)"]
["Decimalen"]
["Codering (EN/NL)","0=No/ Nee\n1=Yes/ Ja"]
["Periode","Sinds start registratie"]
["Wijziging (datum en reden)"]
["Noodzakelijk voor kwaliteitsindicatoren","Nee"]
["Opmerkingen"]
["Zorg Informatie Bouwsteen (ZIB)","ZIB: Verrichting\nContainer (1): MedischHulpmiddel::MedischHulpmiddel\nContainer (2): Product\nDataelement: ProductType\nOmzetting naar LROI:"]
["Voorbeeld","<carpalCemented>1</carpalCemented>"]
[]
["Terug naar Overzicht"]

{"sheet":"Proximale component gecem","index":210,"n_rows":23,"n_cols":2,"rows_kept":23,"cut":false,"hidden":false,"merged":[]}
["DATA_ID",{"$f":"INDEX(Overzicht_unique!$A:$AJ, MATCH($B$2,Overzicht_unique!$A:$A,0), 36)","v":"LROI606"}]
["LROI uitvraag","Proximale component gecementeerd"]
["Variabelenaam XML","proximalCemented"]
["Variabelenaam database","cemented_prox_comp"]
["Label EN","Proximal component cemented"]
["Label NL","Proximale component gecementeerd"]
["Definitie","Indien hybride fixatie, proximale component gecementeerd"]
["Doel / reden uitvraag","Inzicht in kwaliteit; operatiemethode"]
["Waarde verplicht","Functioneel verplicht indien hybride fixatie"]
["Datatype","Integer (INT)"]
["Domein (acceptabele range, min-max)"]
["Eenheid"]
["Format (max. lengte)"]
["Decimalen"]
["Codering (EN/NL)","0=No/ Nee\n1=Yes/ Ja"]
["Periode","Sinds start registratie"]
["Wijziging (datum en reden)"]
["Noodzakelijk voor kwaliteitsindicatoren","Nee"]
["Opmerkingen"]
["Zorg Informatie Bouwsteen (ZIB)","ZIB: Verrichting\nContainer (1): MedischHulpmiddel::MedischHulpmiddel\nContainer (2): Product\nDataelement: ProductType\nOmzetting naar LROI:"]
["Voorbeeld","<proximalCemented>1</proximalCemented>"]
[]
["Terug naar Overzicht"]

{"sheet":"Distale component gecementeerd","index":211,"n_rows":23,"n_cols":2,"rows_kept":23,"cut":false,"hidden":false,"merged":[]}
["DATA_ID",{"$f":"INDEX(Overzicht_unique!$A:$AJ, MATCH($B$2,Overzicht_unique!$A:$A,0), 36)","v":"LROI607"}]
["LROI uitvraag","Distale component gecementeerd"]
["Variabelenaam XML","distalCemented"]
["Variabelenaam database","cemented_dist_comp"]
["Label EN","Distal component cemented"]
["Label NL","Distale component gecementeerd"]
["Definitie","Indien hybride fixatie, distale component gecementeerd"]
["Doel / reden uitvraag","Inzicht in kwaliteit; operatiemethode"]
["Waarde verplicht","Functioneel verplicht indien hybride fixatie"]
["Datatype","Integer (INT)"]
["Domein (acceptabele range, min-max)"]
["Eenheid"]
["Format (max. lengte)"]
["Decimalen"]
["Codering (EN/NL)","0=No/ Nee\n1=Yes/ Ja"]
["Periode","Sinds start registratie"]
["Wijziging (datum en reden)"]
["Noodzakelijk voor kwaliteitsindicatoren","Nee"]
["Opmerkingen"]
["Zorg Informatie Bouwsteen (ZIB)","ZIB: Verrichting\nContainer (1): MedischHulpmiddel::MedischHulpmiddel\nContainer (2): Product\nDataelement: ProductType\nOmzetting naar LROI:"]
["Voorbeeld","<distalCemented>1</distalCemented>"]
[]
["Terug naar Overzicht"]

{"sheet":"Productnummer cement 1","index":212,"n_rows":23,"n_cols":2,"rows_kept":23,"cut":false,"hidden":false,"merged":[]}
["DATA_ID",{"$f":"INDEX(Overzicht_unique!$A:$AJ, MATCH($B$2,Overzicht_unique!$A:$A,0), 36)","v":"LROI070, LROI173, LROI258, LROI344, LROI434, LROI530, LROI608"}]
["LROI uitvraag","Productnummer cement 1"]
["Variabelenaam XML","productNumberCement"]
["Variabelenaam database","cement1_prod_nr"]
["Label EN","Product number cement 1"]
["Label NL","Productnummer cement 1"]
["Definitie","Referentienummer van geplaatst cement"]
["Doel / reden uitvraag","De registratie van productnummers (REF- en LOT-nummers) maakt het mogelijk om een prothese te traceren als er sprake is van een calamiteit. Wanneer een prothesecomponent met een bepaald productnummer in de LROI geregistreerd wordt, worden de eigenschappen van deze component aan de ingreep gekoppeld. Als het nodig is, kan men via de productnummers nieuwe informatie over de prothese achterhalen en de implantaatbibliotheek daarmee verder uitbreiden."]
["Waarde verplicht","Functioneel verplicht"]
["Datatype","Tekst (TXT)"]
["Domein (acceptabele range, min-max)"]
["Eenheid"]
["Format (max. lengte)",40]
["Decimalen"]
["Codering (EN/NL)"]
["Periode","Sinds start registratie"]
["Wijziging (datum en reden)"]
["Noodzakelijk voor kwaliteitsindicatoren","Nee"]
["Opmerkingen","Als aanlevering met code hoeven deze velden niet aangeleverd te worden."]
["Zorg Informatie Bouwsteen (ZIB)","ZIB: Verrichting\nContainer (1): MedischHulpmiddel::MedischHulpmiddel\nContainer (2): Product\nDataelement: ProductID\nOmzetting naar LROI:"]
["Voorbeeld","<Cements>\n<Cement>\n<productNumberCement>04260102132436</productNumberCement>\n<lotNumberCement>L106</lotNumberCement>\n</Cement>\n</Cements>"]
[]
["Terug naar Overzicht"]

{"sheet":"Lotnummer cement 1","index":213,"n_rows":23,"n_cols":2,"rows_kept":23,"cut":false,"hidden":false,"merged":[]}
["DATA_ID",{"$f":"INDEX(Overzicht_unique!$A:$AJ, MATCH($B$2,Overzicht_unique!$A:$A,0), 36)","v":"LROI071, LROI174, LROI259, LROI345, LROI435, LROI531, LROI609"}]
["LROI uitvraag","Lotnummer cement 1"]
["Variabelenaam XML","lotNumberCement"]
["Variabelenaam database","cement1_lot_nr"]
["Label EN","Lot number cement 1"]
["Label NL","Lotnummer cement 1"]
["Definitie","LOT-nummer van geplaatst cement"]
["Doel / reden uitvraag","De registratie van productnummers (REF- en LOT-nummers) maakt het mogelijk om een prothese te traceren als er sprake is van een calamiteit. Wanneer een prothesecomponent met een bepaald productnummer in de LROI geregistreerd wordt, worden de eigenschappen van deze component aan de ingreep gekoppeld. Als het nodig is, kan men via de productnummers nieuwe informatie over de prothese achterhalen en de implantaatbibliotheek daarmee verder uitbreiden."]
["Waarde verplicht","Functioneel verplicht"]
["Datatype","Tekst (TXT)"]
["Domein (acceptabele range, min-max)"]
["Eenheid"]
["Format (max. lengte)",40]
["Decimalen"]
["Codering (EN/NL)"]
["Periode","Sinds start registratie"]
["Wijziging (datum en reden)"]
["Noodzakelijk voor kwaliteitsindicatoren","Nee"]
["Opmerkingen","Als aanlevering met code hoeven deze velden niet aangeleverd te worden."]
["Zorg Informatie Bouwsteen (ZIB)","ZIB: Verrichting\nContainer (1): MedischHulpmiddel::MedischHulpmiddel\nContainer (2): Product\nDataelement: ProductID\nOmzetting naar LROI:"]
["Voorbeeld","<Cements>\n<Cement>\n<productNumberCement>04260102132436</productNumberCement>\n<lotNumberCement>L106</lotNumberCement>\n</Cement>\n</Cements>"]
[]
["Terug naar Overzicht"]

{"sheet":"Productnummer cement 2","index":214,"n_rows":23,"n_cols":2,"rows_kept":23,"cut":false,"hidden":false,"merged":[]}
["DATA_ID",{"$f":"INDEX(Overzicht_unique!$A:$AJ, MATCH($B$2,Overzicht_unique!$A:$A,0), 36)","v":"LROI072, LROI175, LROI260, LROI346, LROI436, LROI532, LROI610"}]
["LROI uitvraag","Productnummer cement 2"]
["Variabelenaam XML","productNumberCement"]
["Variabelenaam database","cement2_prod_nr"]
["Label EN","Product number cement 2"]
["Label NL","Productnummer cement 2"]
["Definitie","Referentienummer van geplaatst cement"]
["Doel / reden uitvraag","De registratie van productnummers (REF- en LOT-nummers) maakt het mogelijk om een prothese te traceren als er sprake is van een calamiteit. Wanneer een prothesecomponent met een bepaald productnummer in de LROI geregistreerd wordt, worden de eigenschappen van deze component aan de ingreep gekoppeld. Als het nodig is, kan men via de productnummers nieuwe informatie over de prothese achterhalen en de implantaatbibliotheek daarmee verder uitbreiden."]
["Waarde verplicht","Functioneel verplicht"]
["Datatype","Tekst (TXT)"]
["Domein (acceptabele range, min-max)"]
["Eenheid"]
["Format (max. lengte)",40]
["Decimalen"]
["Codering (EN/NL)"]
["Periode","Sinds start registratie"]
["Wijziging (datum en reden)"]
["Noodzakelijk voor kwaliteitsindicatoren","Nee"]
["Opmerkingen","Als aanlevering met code hoeven deze velden niet aangeleverd te worden."]
["Zorg Informatie Bouwsteen (ZIB)","ZIB: Verrichting\nContainer (1): MedischHulpmiddel::MedischHulpmiddel\nContainer (2): Product\nDataelement: ProductID\nOmzetting naar LROI:"]
["Voorbeeld","<Cements>\n<Cement>\n<productNumberCement>04260102132436</productNumberCement>\n<lotNumberCement>L106</lotNumberCement>\n</Cement>\n</Cements>"]
[]
["Terug naar Overzicht"]

{"sheet":"Lotnummer cement 2","index":215,"n_rows":23,"n_cols":2,"rows_kept":23,"cut":false,"hidden":false,"merged":[]}
["DATA_ID",{"$f":"INDEX(Overzicht_unique!$A:$AJ, MATCH($B$2,Overzicht_unique!$A:$A,0), 36)","v":"LROI071, LROI174, LROI259, LROI345, LROI435, LROI531, LROI609"}]
["LROI uitvraag","Lotnummer cement 1"]
["Variabelenaam XML","lotNumberCement"]
["Variabelenaam database","cement1_lot_nr"]
["Label EN","Lot number cement 1"]
["Label NL","Lotnummer cement 1"]
["Definitie","LOT-nummer van geplaatst cement"]
["Doel / reden uitvraag","De registratie van productnummers (REF- en LOT-nummers) maakt het mogelijk om een prothese te traceren als er sprake is van een calamiteit. Wanneer een prothesecomponent met een bepaald productnummer in de LROI geregistreerd wordt, worden de eigenschappen van deze component aan de ingreep gekoppeld. Als het nodig is, kan men via de productnummers nieuwe informatie over de prothese achterhalen en de implantaatbibliotheek daarmee verder uitbreiden."]
["Waarde verplicht","Functioneel verplicht"]
["Datatype","Tekst (TXT)"]
["Domein (acceptabele range, min-max)"]
["Eenheid"]
["Format (max. lengte)",40]
["Decimalen"]
["Codering (EN/NL)"]
["Periode","Sinds start registratie"]
["Wijziging (datum en reden)"]
["Noodzakelijk voor kwaliteitsindicatoren","Nee"]
["Opmerkingen","Als aanlevering met code hoeven deze velden niet aangeleverd te worden."]
["Zorg Informatie Bouwsteen (ZIB)","ZIB: Verrichting\nContainer (1): MedischHulpmiddel::MedischHulpmiddel\nContainer (2): Product\nDataelement: ProductID\nOmzetting naar LROI:"]
["Voorbeeld","<Cements>\n<Cement>\n<productNumberCement>04260102132436</productNumberCement>\n<lotNumberCement>L106</lotNumberCement>\n</Cement>\n</Cements>"]
[]
["Terug naar Overzicht"]

{"sheet":"Productnummer cement 3","index":216,"n_rows":23,"n_cols":2,"rows_kept":23,"cut":false,"hidden":false,"merged":[]}
["DATA_ID",{"$f":"INDEX(Overzicht_unique!$A:$AJ, MATCH($B$2,Overzicht_unique!$A:$A,0), 36)","v":"LROI074, LROI177, LROI262, LROI348, LROI438, LROI534, LROI612"}]
["LROI uitvraag","Productnummer cement 3"]
["Variabelenaam XML","productNumberCement"]
["Variabelenaam database","cement3_prod_nr"]
["Label EN","Product number cement 3"]
["Label NL","Productnummer cement 3"]
["Definitie","Referentienummer van geplaatst cement"]
["Doel / reden uitvraag","De registratie van productnummers (REF- en LOT-nummers) maakt het mogelijk om een prothese te traceren als er sprake is van een calamiteit. Wanneer een prothesecomponent met een bepaald productnummer in de LROI geregistreerd wordt, worden de eigenschappen van deze component aan de ingreep gekoppeld. Als het nodig is, kan men via de productnummers nieuwe informatie over de prothese achterhalen en de implantaatbibliotheek daarmee verder uitbreiden."]
["Waarde verplicht","Functioneel verplicht"]
["Datatype","Tekst (TXT)"]
["Domein (acceptabele range, min-max)"]
["Eenheid"]
["Format (max. lengte)",40]
["Decimalen"]
["Codering (EN/NL)"]
["Periode","Sinds start registratie"]
["Wijziging (datum en reden)"]
["Noodzakelijk voor kwaliteitsindicatoren","Nee"]
["Opmerkingen","Als aanlevering met code hoeven deze velden niet aangeleverd te worden."]
["Zorg Informatie Bouwsteen (ZIB)","ZIB: Verrichting\nContainer (1): MedischHulpmiddel::MedischHulpmiddel\nContainer (2): Product\nDataelement: ProductID\nOmzetting naar LROI:"]
["Voorbeeld","<Cements>\n<Cement>\n<productNumberCement>04260102132436</productNumberCement>\n<lotNumberCement>L106</lotNumberCement>\n</Cement>\n</Cements>"]
[]
["Terug naar Overzicht"]

{"sheet":"Lotnummer cement 3","index":217,"n_rows":23,"n_cols":2,"rows_kept":23,"cut":false,"hidden":false,"merged":[]}
["DATA_ID",{"$f":"INDEX(Overzicht_unique!$A:$AJ, MATCH($B$2,Overzicht_unique!$A:$A,0), 36)","v":"LROI075, LROI178, LROI263, LROI349, LROI439, LROI535, LROI613"}]
["LROI uitvraag","Lotnummer cement 3"]
["Variabelenaam XML","lotNumberCement"]
["Variabelenaam database","cement3_lot_nr"]
["Label EN","Lot number cement 3"]
["Label NL","Lotnummer cement 3"]
["Definitie","LOT-nummer van geplaatst cement"]
["Doel / reden uitvraag","De registratie van productnummers (REF- en LOT-nummers) maakt het mogelijk om een prothese te traceren als er sprake is van een calamiteit. Wanneer een prothesecomponent met een bepaald productnummer in de LROI geregistreerd wordt, worden de eigenschappen van deze component aan de ingreep gekoppeld. Als het nodig is, kan men via de productnummers nieuwe informatie over de prothese achterhalen en de implantaatbibliotheek daarmee verder uitbreiden."]
["Waarde verplicht","Functioneel verplicht"]
["Datatype","Tekst (TXT)"]
["Domein (acceptabele range, min-max)"]
["Eenheid"]
["Format (max. lengte)",40]
["Decimalen"]
["Codering (EN/NL)"]
["Periode","Sinds start registratie"]
["Wijziging (datum en reden)"]
["Noodzakelijk voor kwaliteitsindicatoren","Nee"]
["Opmerkingen","Als aanlevering met code hoeven deze velden niet aangeleverd te worden."]
["Zorg Informatie Bouwsteen (ZIB)","ZIB: Verrichting\nContainer (1): MedischHulpmiddel::MedischHulpmiddel\nContainer (2): Product\nDataelement: ProductID\nOmzetting naar LROI:"]
["Voorbeeld","<Cements>\n<Cement>\n<productNumberCement>04260102132436</productNumberCement>\n<lotNumberCement>L106</lotNumberCement>\n</Cement>\n</Cements>"]
[]
["Terug naar Overzicht"]

{"sheet":"Productnummer cement 4","index":218,"n_rows":23,"n_cols":2,"rows_kept":23,"cut":false,"hidden":false,"merged":[]}
["DATA_ID",{"$f":"INDEX(Overzicht_unique!$A:$AJ, MATCH($B$2,Overzicht_unique!$A:$A,0), 36)","v":"LROI076, LROI179, LROI264, LROI350, LROI440, LROI536, LROI614"}]
["LROI uitvraag","Productnummer cement 4"]
["Variabelenaam XML","productNumberCement"]
["Variabelenaam database","cement4_prod_nr"]
["Label EN","Product number cement 4"]
["Label NL","Productnummer cement 4"]
["Definitie","Referentienummer van geplaatst cement"]
["Doel / reden uitvraag","De registratie van productnummers (REF- en LOT-nummers) maakt het mogelijk om een prothese te traceren als er sprake is van een calamiteit. Wanneer een prothesecomponent met een bepaald productnummer in de LROI geregistreerd wordt, worden de eigenschappen van deze component aan de ingreep gekoppeld. Als het nodig is, kan men via de productnummers nieuwe informatie over de prothese achterhalen en de implantaatbibliotheek daarmee verder uitbreiden."]
["Waarde verplicht","Functioneel verplicht"]
["Datatype","Tekst (TXT)"]
["Domein (acceptabele range, min-max)"]
["Eenheid"]
["Format (max. lengte)",40]
["Decimalen"]
["Codering (EN/NL)"]
["Periode","Sinds start registratie"]
["Wijziging (datum en reden)"]
["Noodzakelijk voor kwaliteitsindicatoren","Nee"]
["Opmerkingen","Als aanlevering met code hoeven deze velden niet aangeleverd te worden."]
["Zorg Informatie Bouwsteen (ZIB)","ZIB: Verrichting\nContainer (1): MedischHulpmiddel::MedischHulpmiddel\nContainer (2): Product\nDataelement: ProductID\nOmzetting naar LROI:"]
["Voorbeeld","<Cements>\n<Cement>\n<productNumberCement>04260102132436</productNumberCement>\n<lotNumberCement>L106</lotNumberCement>\n</Cement>\n</Cements>"]
[]
["Terug naar Overzicht"]

{"sheet":"Lotnummer cement 4","index":219,"n_rows":23,"n_cols":2,"rows_kept":23,"cut":false,"hidden":false,"merged":[]}
["DATA_ID",{"$f":"INDEX(Overzicht_unique!$A:$AJ, MATCH($B$2,Overzicht_unique!$A:$A,0), 36)","v":"LROI077, LROI180, LROI265, LROI351, LROI441, LROI537, LROI615"}]
["LROI uitvraag","Lotnummer cement 4"]
["Variabelenaam XML","lotNumberCement"]
["Variabelenaam database","cement4_lot_nr"]
["Label EN","Lot number cement 4"]
["Label NL","Lotnummer cement 4"]
["Definitie","LOT-nummer van geplaatst cement"]
["Doel / reden uitvraag","De registratie van productnummers (REF- en LOT-nummers) maakt het mogelijk om een prothese te traceren als er sprake is van een calamiteit. Wanneer een prothesecomponent met een bepaald productnummer in de LROI geregistreerd wordt, worden de eigenschappen van deze component aan de ingreep gekoppeld. Als het nodig is, kan men via de productnummers nieuwe informatie over de prothese achterhalen en de implantaatbibliotheek daarmee verder uitbreiden."]
["Waarde verplicht","Functioneel verplicht"]
["Datatype","Tekst (TXT)"]
["Domein (acceptabele range, min-max)"]
["Eenheid"]
["Format (max. lengte)",40]
["Decimalen"]
["Codering (EN/NL)"]
["Periode","Sinds start registratie"]
["Wijziging (datum en reden)"]
["Noodzakelijk voor kwaliteitsindicatoren","Nee"]
["Opmerkingen","Als aanlevering met code hoeven deze velden niet aangeleverd te worden."]
["Zorg Informatie Bouwsteen (ZIB)","ZIB: Verrichting\nContainer (1): MedischHulpmiddel::MedischHulpmiddel\nContainer (2): Product\nDataelement: ProductID\nOmzetting naar LROI:"]
["Voorbeeld","<Cements>\n<Cement>\n<productNumberCement>04260102132436</productNumberCement>\n<lotNumberCement>L106</lotNumberCement>\n</Cement>\n</Cements>"]
[]
["Terug naar Overzicht"]

{"sheet":"Productnummer","index":220,"n_rows":23,"n_cols":2,"rows_kept":23,"cut":false,"hidden":false,"merged":[]}
["DATA_ID","LROI78, LROI81, LROI83, LROI85, LROI88, LROI90, LROI93, LROI181, LROI184, LROI186, LROI189, LROI191, LROI193, LROI266, LROI268, LROI270, LROI352, LROI354, LROI356, LROI358, LROI360, \nLROI442, LROI445, LROI447, LROI450, LROI452, LROI454, LROI538, LROI540, LROI542, LROI544, LROI546, LROI548, LROI550, LROI552, LROI616, LROI618, LROI620, LROI622"]
["LROI uitvraag","Productnummer"]
["Variabelenaam XML","productNumberAcetabularComponent1, productNumberAcetabularComponent2, productNumberCarpalComponent1, productNumberCarpalComponent2, productNumberCarpalComponent3, productNumberDistalHeadComponent, productNumberDistalStemComponent, productNumberFemoralComponent1, productNumberFemoralComponent2, productNumberGlenoidCup, productNumberGlenoidLiner, productNumberHead1, productNumberHead2, productNumberHumeralComponent, productNumberHumeralComponent1, productNumberHumeralComponent2, productNumberHumeralHead, productNumberInlay, productNumberInlayComponent, productNumberInlayComponent, productNumberMetaphysealComponent, productNumberPatellaComponent, productNumberProximalHeadComponent, productNumberProximalStemComponent, productNumberRadialHeadComponent, productNumberRadialStemComponent, productNumberTalusComponent, productNumberTibiaComponent1, productNumberTibiaComponent2, productNumberTibialComponent, productNumberUlnarComponent1, productNumberUlnarComponent2, productNumberUlnarHeadComponent, productNumberUlnarStemComponent"]
["Variabelenaam database","\"component\"_prod_nr; bijvoorbeeld acetabulum_prod_nr, femur_prod_nr; inlay_prod_nr; femoralhead_prod_nr etc. "]
["Label EN","Product number"]
["Label NL","Productnummer"]
["Definitie","Referentienummer van geplaatst component"]
["Doel / reden uitvraag","De registratie van productnummers (REF- en LOT-nummers) maakt het mogelijk om een prothese te traceren als er sprake is van een calamiteit. Wanneer een prothesecomponent met een bepaald productnummer in de LROI geregistreerd wordt, worden de eigenschappen van deze component aan de ingreep gekoppeld. Als het nodig is, kan men via de productnummers nieuwe informatie over de prothese achterhalen en de implantaatbibliotheek daarmee verder uitbreiden."]
["Waarde verplicht","Functioneel verplicht"]
["Datatype","Tekst (TXT)"]
["Domein (acceptabele range, min-max)"]
["Eenheid"]
["Format (max. lengte)",40]
["Decimalen"]
["Codering (EN/NL)"]
["Periode","Sinds start registratie"]
["Wijziging (datum en reden)"]
["Noodzakelijk voor kwaliteitsindicatoren","Nee"]
["Opmerkingen","Als aanlevering met code hoeven deze velden niet aangeleverd te worden."]
["Zorg Informatie Bouwsteen (ZIB)","ZIB: Verrichting\nContainer (1): MedischHulpmiddel::MedischHulpmiddel\nContainer (2): Product\nDataelement: ProductID\nOmzetting naar LROI:"]
["Voorbeeld","<Components/>\n<productNumberFemoralComponent1>03596010206046</productNumberFemoralComponent1>\n<lotNumberFemoralComponent1>U2142654</lotNumberFemoralComponent1>\n<productNumberFemoralComponent2/>\n<lotNumberFemoralComponent2/>\n<productNumberTibiaComponent1>03596010206343</productNumberTibiaComponent1>\n<lotNumberTibiaComponent1>G2142141</lotNumberTibiaComponent1>"]
[]
["Terug naar Overzicht"]

{"sheet":"Lot nummer","index":221,"n_rows":23,"n_cols":2,"rows_kept":23,"cut":false,"hidden":false,"merged":[]}
["DATA_ID","LROI79, LROI82, LROI84, LROI86, LROI89, LROI91, LROI94, LROI96, LROI182, LROI185, LROI187, LROI190, LROI192, LROI194, LROI196, LROI267, LROI269, LROI271, LROI273, LROI353, LROI355, LROI357, LROI359, LROI361, LROI363, LROI443, LROI446, LROI448, LROI451, LROI453, LROI455, LROI457, LROI539, LROI541, LROI543, LROI545, LROI547, LROI549, LROI551, LROI553, LROI555, LROI617, LROI619, LROI621, LROI623, LROI625"]
["LROI uitvraag","Lot nummer"]
["Variabelenaam XML","lotNumberAcetabularComponent1, lotNumberAcetabularComponent2, lotNumberCarpalComponent1, lotNumberCarpalComponent2, lotNumberCarpalComponent3, lotNumberDistalHeadComponent, lotNumberDistalStemComponent, lotNumberFemoralComponent1, lotNumberFemoralComponent2, lotNumberGlenoidCup, lotNumberGlenoidLiner, lotNumberHead1, lotNumberHead2, lotNumberHumeralComponent, lotNumberHumeralComponent1, lotNumberHumeralComponent2, lotNumberHumeralHead, lotNumberInlay, lotNumberInlayComponent, lotNumberInlayComponent, lotNumberMetaphysealComponent, lotNumberPatellaComponent, lotNumberProximalHeadComponent, lotNumberProximalStemComponent, lotNumberRadialHeadComponent, lotNumberRadialStemComponent, lotNumberTalusComponent, lotNumberTibiaComponent1, lotNumberTibiaComponent2, lotNumberTibialComponent, lotNumberUlnarComponent1, lotNumberUlnarComponent2, lotNumberUlnarHeadComponent, lotNumberUlnarStemComponent, lotNumber"]
["Variabelenaam database","\"component\"_lot_nr; bijvoorbeeld acetabulum_lot_nr, femur_lot_nr; inlay_lot_nr; femoralhead_lot_nr etc. "]
["Label EN","Lot number"]
["Label NL","Lot nummer"]
["Definitie","LOT-nummer van geplaatst component"]
["Doel / reden uitvraag","De registratie van productnummers (REF- en LOT-nummers) maakt het mogelijk om een prothese te traceren als er sprake is van een calamiteit. Wanneer een prothesecomponent met een bepaald productnummer in de LROI geregistreerd wordt, worden de eigenschappen van deze component aan de ingreep gekoppeld. Als het nodig is, kan men via de productnummers nieuwe informatie over de prothese achterhalen en de implantaatbibliotheek daarmee verder uitbreiden."]
["Waarde verplicht","Functioneel verplicht"]
["Datatype","Tekst (TXT)"]
["Domein (acceptabele range, min-max)"]
["Eenheid"]
["Format (max. lengte)",40]
["Decimalen"]
["Codering (EN/NL)"]
["Periode","Sinds start registratie"]
["Wijziging (datum en reden)"]
["Noodzakelijk voor kwaliteitsindicatoren","Nee"]
["Opmerkingen","Als aanlevering met code hoeven deze velden niet aangeleverd te worden."]
["Zorg Informatie Bouwsteen (ZIB)","ZIB: Verrichting\nContainer (1): MedischHulpmiddel::MedischHulpmiddel\nContainer (2): Product\nDataelement: ProductID\nOmzetting naar LROI:"]
["Voorbeeld","<Components/>\n<productNumberFemoralComponent1>03596010206046</productNumberFemoralComponent1>\n<lotNumberFemoralComponent1>U2142654</lotNumberFemoralComponent1>\n<productNumberFemoralComponent2/>\n<lotNumberFemoralComponent2/>\n<productNumberTibiaComponent1>03596010206343</productNumberTibiaComponent1>\n<lotNumberTibiaComponent1>G2142141</lotNumberTibiaComponent1>"]
[]
["Terug naar Overzicht"]

{"sheet":"Meer dan 1 acetabulumcomponent","index":222,"n_rows":23,"n_cols":2,"rows_kept":23,"cut":false,"hidden":false,"merged":[]}
["DATA_ID","LROI80"]
["LROI uitvraag","Meer dan 1 acetabulumcomponent?"]
["Variabelenaam XML","moreAcetabularComponents"]
["Variabelenaam database","acetabulum2_prod_nr; acetabulum2_lot_nr etc. "]
["Label EN","More than 1 acetabular component used"]
["Label NL","Meer dan 1 acetabulumcomponent?"]
["Definitie"]
["Doel / reden uitvraag","Mogelijkheid registratie van meerdere acetabulumcomponenten"]
["Waarde verplicht","Functioneel verplicht"]
["Datatype","Integer (INT)"]
["Domein (acceptabele range, min-max)"]
["Eenheid"]
["Format (max. lengte)"]
["Decimalen"]
["Codering (EN/NL)","0=No/ Nee\n1=Yes/ Ja"]
["Periode","Sinds start registratie"]
["Wijziging (datum en reden)"]
["Noodzakelijk voor kwaliteitsindicatoren","Nee"]
["Opmerkingen","Als aanlevering met code hoeven deze velden niet aangeleverd te worden."]
["Zorg Informatie Bouwsteen (ZIB)","ZIB: Verrichting\nContainer (1): MedischHulpmiddel::MedischHulpmiddel\nContainer (2): Product\nDataelement: ProductID\nOmzetting naar LROI:"]
["Voorbeeld"]
[]
["Terug naar Overzicht"]

{"sheet":"Meer dan 1 femurcomponent","index":223,"n_rows":23,"n_cols":2,"rows_kept":23,"cut":false,"hidden":false,"merged":[]}
["DATA_ID","LROI87"]
["LROI uitvraag","Meer dan 1 femurcomponent?"]
["Variabelenaam XML","moreFemoralComponents"]
["Variabelenaam database","femur2_prod_nr; femur2_lot_nr etc. "]
["Label EN","More than 1 femur stem component?"]
["Label NL","Meer dan 1 femurcomponent?"]
["Definitie"]
["Doel / reden uitvraag","Mogelijkheid registratie van meerdere femurcomponenten"]
["Waarde verplicht","Functioneel verplicht"]
["Datatype","Integer (INT)"]
["Domein (acceptabele range, min-max)"]
["Eenheid"]
["Format (max. lengte)"]
["Decimalen"]
["Codering (EN/NL)","0=No/ Nee\n1=Yes/ Ja"]
["Periode","Sinds start registratie"]
["Wijziging (datum en reden)"]
["Noodzakelijk voor kwaliteitsindicatoren","Nee"]
["Opmerkingen","Als aanlevering met code hoeven deze velden niet aangeleverd te worden."]
["Zorg Informatie Bouwsteen (ZIB)","ZIB: Verrichting\nContainer (1): MedischHulpmiddel::MedischHulpmiddel\nContainer (2): Product\nDataelement: ProductID\nOmzetting naar LROI:"]
["Voorbeeld"]
[]
["Terug naar Overzicht"]

{"sheet":"Meer dan 1 femurkopcomponent","index":224,"n_rows":23,"n_cols":2,"rows_kept":23,"cut":false,"hidden":false,"merged":[]}
["DATA_ID","LROI92"]
["LROI uitvraag","Meer dan 1 femurkopcomponent?"]
["Variabelenaam XML","moreHeads"]
["Variabelenaam database","femoralhead2_prod_nr; femoralhead2_lot_nr etc. "]
["Label EN","More than 1 femur head used?"]
["Label NL","Meer dan 1 femurkopcomponent?"]
["Definitie"]
["Doel / reden uitvraag","Mogelijkheid registratie van meerdere femurkopcomponenten"]
["Waarde verplicht","Functioneel verplicht"]
["Datatype","Integer (INT)"]
["Domein (acceptabele range, min-max)"]
["Eenheid"]
["Format (max. lengte)"]
["Decimalen"]
["Codering (EN/NL)","0=No/ Nee\n1=Yes/ Ja"]
["Periode","Sinds start registratie"]
["Wijziging (datum en reden)"]
["Noodzakelijk voor kwaliteitsindicatoren","Nee"]
["Opmerkingen","Als aanlevering met code hoeven deze velden niet aangeleverd te worden."]
["Zorg Informatie Bouwsteen (ZIB)","ZIB: Verrichting\nContainer (1): MedischHulpmiddel::MedischHulpmiddel\nContainer (2): Product\nDataelement: ProductID\nOmzetting naar LROI:"]
["Voorbeeld"]
[]
["Terug naar Overzicht"]

{"sheet":"Meer dan 1 femoral component","index":225,"n_rows":23,"n_cols":2,"rows_kept":23,"cut":false,"hidden":false,"merged":[]}
["DATA_ID","LROI183"]
["LROI uitvraag","Meer dan 1 femoral component?"]
["Variabelenaam XML","moreFemoralComponents"]
["Variabelenaam database"]
["Label EN","More than 1 Femoral component?"]
["Label NL","Meer dan 1 femoral component?"]
["Definitie"]
["Doel / reden uitvraag","Mogelijkheid registratie van meerdere femurcomponenten"]
["Waarde verplicht","Functioneel verplicht"]
["Datatype","Integer (INT)"]
["Domein (acceptabele range, min-max)"]
["Eenheid"]
["Format (max. lengte)"]
["Decimalen"]
["Codering (EN/NL)","0=No/ Nee\n1=Yes/ Ja"]
["Periode","Sinds start registratie"]
["Wijziging (datum en reden)"]
["Noodzakelijk voor kwaliteitsindicatoren","Nee"]
["Opmerkingen","Als aanlevering met code hoeven deze velden niet aangeleverd te worden."]
["Zorg Informatie Bouwsteen (ZIB)","ZIB: Verrichting\nContainer (1): MedischHulpmiddel::MedischHulpmiddel\nContainer (2): Product\nDataelement: ProductID\nOmzetting naar LROI:"]
["Voorbeeld"]
[]
["Terug naar Overzicht"]

{"sheet":"Meer dan 1 tibia component","index":226,"n_rows":23,"n_cols":2,"rows_kept":23,"cut":false,"hidden":false,"merged":[]}
["DATA_ID","LROI188"]
["LROI uitvraag","Meer dan 1 tibia component?"]
["Variabelenaam XML","moreTibiaComponents"]
["Variabelenaam database"]
["Label EN","More than 1 Tibia component?"]
["Label NL","Meer dan 1 tibia component?"]
["Definitie"]
["Doel / reden uitvraag","Mogelijkheid registratie van meerdere tibiacomponenten"]
["Waarde verplicht","Functioneel verplicht"]
["Datatype","Integer (INT)"]
["Domein (acceptabele range, min-max)"]
["Eenheid"]
["Format (max. lengte)"]
["Decimalen"]
["Codering (EN/NL)","0=No/ Nee\n1=Yes/ Ja"]
["Periode","Sinds start registratie"]
["Wijziging (datum en reden)"]
["Noodzakelijk voor kwaliteitsindicatoren","Nee"]
["Opmerkingen","Als aanlevering met code hoeven deze velden niet aangeleverd te worden."]
["Zorg Informatie Bouwsteen (ZIB)","ZIB: Verrichting\nContainer (1): MedischHulpmiddel::MedischHulpmiddel\nContainer (2): Product\nDataelement: ProductID\nOmzetting naar LROI:"]
["Voorbeeld"]
[]
["Terug naar Overzicht"]

{"sheet":"Meer dan 1 humerus component","index":227,"n_rows":23,"n_cols":2,"rows_kept":23,"cut":false,"hidden":false,"merged":[]}
["DATA_ID","LROI444"]
["LROI uitvraag","Meer dan 1 humerus component?"]
["Variabelenaam XML","moreHumeralComponents"]
["Variabelenaam database","humerus2_prod_nr; humerus2_lot_nr etc. "]
["Label EN","More than 1 humerus component"]
["Label NL","Meer dan 1 humerus component?"]
["Definitie"]
["Doel / reden uitvraag","Mogelijkheid registratie van meerdere humeruscomponenten"]
["Waarde verplicht","Functioneel verplicht"]
["Datatype","Integer (INT)"]
["Domein (acceptabele range, min-max)"]
["Eenheid"]
["Format (max. lengte)"]
["Decimalen"]
["Codering (EN/NL)","0=No/ Nee\n1=Yes/ Ja"]
["Periode","Sinds start registratie"]
["Wijziging (datum en reden)"]
["Noodzakelijk voor kwaliteitsindicatoren","Nee"]
["Opmerkingen","Als aanlevering met code hoeven deze velden niet aangeleverd te worden."]
["Zorg Informatie Bouwsteen (ZIB)","ZIB: Verrichting\nContainer (1): MedischHulpmiddel::MedischHulpmiddel\nContainer (2): Product\nDataelement: ProductID\nOmzetting naar LROI:"]
["Voorbeeld"]
[]
["Terug naar Overzicht"]

{"sheet":"Meer dan 1 ulna component","index":228,"n_rows":23,"n_cols":2,"rows_kept":23,"cut":false,"hidden":false,"merged":[]}
["DATA_ID","LROI449"]
["LROI uitvraag","Meer dan 1 ulna component?"]
["Variabelenaam XML","moreUlnaComponents"]
["Variabelenaam database","ulna2_prod_nr; ulna2_lot_nr etc. "]
["Label EN","More than 1 ulna component"]
["Label NL","Meer dan 1 ulna component?"]
["Definitie"]
["Doel / reden uitvraag","Mogelijkheid registratie van meerdere ulnacomponenten"]
["Waarde verplicht","Functioneel verplicht"]
["Datatype","Integer (INT)"]
["Domein (acceptabele range, min-max)"]
["Eenheid"]
["Format (max. lengte)"]
["Decimalen"]
["Codering (EN/NL)","0=No/ Nee\n1=Yes/ Ja"]
["Periode","Sinds start registratie"]
["Wijziging (datum en reden)"]
["Noodzakelijk voor kwaliteitsindicatoren","Nee"]
["Opmerkingen","Als aanlevering met code hoeven deze velden niet aangeleverd te worden."]
["Zorg Informatie Bouwsteen (ZIB)","ZIB: Verrichting\nContainer (1): MedischHulpmiddel::MedischHulpmiddel\nContainer (2): Product\nDataelement: ProductID\nOmzetting naar LROI:"]
["Voorbeeld"]
[]
["Terug naar Overzicht"]

{"sheet":"Productnummer (code)","index":229,"n_rows":23,"n_cols":2,"rows_kept":23,"cut":false,"hidden":false,"merged":[]}
["DATA_ID","LROI95, LROI195, LROI272, LROI362, LROI456, LROI554, LROI624"]
["LROI uitvraag","Productnummer"]
["Variabelenaam XML","code"]
["Variabelenaam database","\"component\"_prod_nr; bijvoorbeeld acetabulum_prod_nr, femur_prod_nr; inlay_prod_nr; femoralhead_prod_nr etc. "]
["Label EN","Product number / gtin / gs1"]
["Label NL","Productnummer"]
["Definitie","Referentienummer van geplaatst component"]
["Doel / reden uitvraag","De registratie van productnummers (REF- en LOT-nummers) maakt het mogelijk om een prothese te traceren als er sprake is van een calamiteit. Wanneer een prothesecomponent met een bepaald productnummer in de LROI geregistreerd wordt, worden de eigenschappen van deze component aan de ingreep gekoppeld. Als het nodig is, kan men via de productnummers nieuwe informatie over de prothese achterhalen en de implantaatbibliotheek daarmee verder uitbreiden."]
["Waarde verplicht","Functioneel verplicht"]
["Datatype","Tekst (TXT)"]
["Domein (acceptabele range, min-max)"]
["Eenheid"]
["Format (max. lengte)",200]
["Decimalen"]
["Codering (EN/NL)"]
["Periode","Sinds Ingrepen_v4.0 (2019)"]
["Wijziging (datum en reden)"]
["Noodzakelijk voor kwaliteitsindicatoren","Nee"]
["Opmerkingen","Hier kunnen allerlei codes worden aangeleverd (bijvoorbeeld productnummer, UDI (Unique Device Identifier), artikelnummer, gtin etc.), inclusief volledige en valide barcodes"]
["Zorg Informatie Bouwsteen (ZIB)","ZIB: Verrichting\nContainer (1): MedischHulpmiddel::MedischHulpmiddel\nContainer (2): Product\nDataelement: ProductID\nOmzetting naar LROI:"]
["Voorbeeld","<Components/>\n<Component>\n<code>03596010206046</code>\n<lotNumber>U2142654</lotNumber>"]
[null,"\n"]
["Terug naar Overzicht"]